BDBM50329246 ((3aR,6aS)-5-(3-(1-(cyclopentylsulfonyl)azetidin-3-yl)-3-phenylpropyl)hexahydropyrrolo[3,4-c]pyrrol-2(1H)-yl)(4,6-dimethylpyrimidin-5-yl)methanone::CHEMBL1270595
SMILES: Cc1ncnc(C)c1C(=O)N1C[C@@H]2CN(CCC(C3CN(C3)S(=O)(=O)C3CCCC3)c3ccccc3)C[C@@H]2C1
InChI Key: InChIKey=MPHBRFVEAJJJEM-GYKVFZPVSA-N
Data: 1 IC50
Activity Spreadsheet -- Enzyme Inhibition Constant Data from BindingDB
Found 1 hit for monomerid = 50329246
Trg + Lig
Ki
nM
ΔG°
kcal/mole
IC50
nM
Kd
nM
EC50/IC50
nM
koff
s-1
kon
M-1s-1
pHTemp
°C
C-C motif chemokine 5
(Homo sapiens (Human))
BDBM50329246
(((3aR,6aS)-5-(3-(1-(cyclopentylsulfonyl)azetidin-3...)
Show SMILES Cc1ncnc(C)c1C(=O)N1C[C@@H]2CN(CCC(C3CN(C3)S(=O)(=O)C3CCCC3)c3ccccc3)C[C@@H]2C1 |r|
Show InChI InChI=1S/C30H41N5O3S/c1-21-29(22(2)32-20-31-21)30(36)34-16-24-14-33(15-25(24)17-34)13-12-28(23-8-4-3-5-9-23)26-18-35(19-26)39(37,38)27-10-6-7-11-27/h3-5,8-9,20,24-28H,6-7,10-19H2,1-2H3/t24-,25+,28?
Reactome pathway
n/an/a 22n/an/an/an/an/an/a
Roche Palo Alto
Curated by ChEMBL
Assay Description
Inhibition of RANTES
Bioorg Med Chem Lett 20: 6802-7 (2010)
Article DOI: 10.1016/j.bmcl.2010.08.118
BindingDB Entry DOI: 10.7270/Q29G5N1F