BDBM50329424 5-(2-aminopyrimidin-4-yl)-4-chloro-2-phenyl-1H-pyrrole-3-carboxamide::CHEMBL1270716::US9670191, Z1
SMILES: NC(=O)c1c(Cl)c([nH]c1-c1ccccc1)-c1ccnc(N)n1
InChI Key: InChIKey=PSNUHTHUWXIRLT-UHFFFAOYSA-N
Data: 2 IC50
Activity Spreadsheet -- Enzyme Inhibition Constant Data from BindingDB
Found 2 hits for monomerid = 50329424
Trg + Lig
Ki
nM
ΔG°
kcal/mole
IC50
nM
Kd
nM
EC50/IC50
nM
koff
s-1
kon
M-1s-1
pHTemp
°C
Cdc7 Kinase
(Homo sapiens (Human))
BDBM50329424
(5-(2-aminopyrimidin-4-yl)-4-chloro-2-phenyl-1H-pyr...)
Show SMILES NC(=O)c1c(Cl)c([nH]c1-c1ccccc1)-c1ccnc(N)n1
Show InChI InChI=1S/C15H12ClN5O/c16-11-10(14(17)22)12(8-4-2-1-3-5-8)21-13(11)9-6-7-19-15(18)20-9/h1-7,21H,(H2,17,22)(H2,18,19,20)
Reactome pathway
US Patent
n/an/a<1.00E+3n/an/an/an/an/an/a
NERVIANO MEDICAL SCIENCES S.R.L.
US Patent
Assay Description
The assay consists of the transfer of radioactivity labeled phosphate moiety by the kinase to an acceptor substrate. The resulting 33P-labeled produc...
US Patent US9670191 (2017)
BindingDB Entry DOI: 10.7270/Q2X63K3K
Cell division cycle 7-related protein kinase
(Homo sapiens (Human))
BDBM50329424
(5-(2-aminopyrimidin-4-yl)-4-chloro-2-phenyl-1H-pyr...)
Show SMILES NC(=O)c1c(Cl)c([nH]c1-c1ccccc1)-c1ccnc(N)n1
Show InChI InChI=1S/C15H12ClN5O/c16-11-10(14(17)22)12(8-4-2-1-3-5-8)21-13(11)9-6-7-19-15(18)20-9/h1-7,21H,(H2,17,22)(H2,18,19,20)
Reactome pathway
n/an/a 38n/an/an/an/an/an/a
Nerviano Medical Sciences Srl
Curated by ChEMBL
Assay Description
Inhibition of Cdc7
J Med Chem 53: 7296-315 (2010)
Article DOI: 10.1021/jm100504d
BindingDB Entry DOI: 10.7270/Q24T6JM3