BDBM50329432 2-iso-Propyl-5-pyridin-4-yl-1H-pyrrole-3-carboxamide::CHEMBL1269784
SMILES: CC(C)c1[nH]c(cc1C(N)=O)-c1ccncc1
InChI Key: InChIKey=PSBSQCWVPKXBMK-UHFFFAOYSA-N
Data: 1 IC50
Activity Spreadsheet -- Enzyme Inhibition Constant Data from BindingDB
Found 1 hit for monomerid = 50329432
Trg + Lig
Ki
nM
ΔG°
kcal/mole
IC50
nM
Kd
nM
EC50/IC50
nM
koff
s-1
kon
M-1s-1
pHTemp
°C
Cell division cycle 7-related protein kinase
(Homo sapiens (Human))
BDBM50329432
(2-iso-Propyl-5-pyridin-4-yl-1H-pyrrole-3-carboxami...)
Show SMILES CC(C)c1[nH]c(cc1C(N)=O)-c1ccncc1
Show InChI InChI=1S/C13H15N3O/c1-8(2)12-10(13(14)17)7-11(16-12)9-3-5-15-6-4-9/h3-8,16H,1-2H3,(H2,14,17)
Reactome pathway
n/an/a 463n/an/an/an/an/an/a
Nerviano Medical Sciences Srl
Curated by ChEMBL
Assay Description
Inhibition of Cdc7
J Med Chem 53: 7296-315 (2010)
Article DOI: 10.1021/jm100504d
BindingDB Entry DOI: 10.7270/Q24T6JM3