BDBM50329444 5-(2-Amino-pyrimidin-4-yl)-2-pyridin-2-yl-1H-pyrrole-3-carboxamide::CHEMBL1271127::US9670191, G12
SMILES: NC(=O)c1cc([nH]c1-c1ccccn1)-c1ccnc(N)n1
InChI Key: InChIKey=LFPIEHOXJZOQHM-UHFFFAOYSA-N
Data: 2 IC50
Activity Spreadsheet -- Enzyme Inhibition Constant Data from BindingDB
Found 2 hits for monomerid = 50329444
Trg + Lig
Ki
nM
ΔG°
kcal/mole
IC50
nM
Kd
nM
EC50/IC50
nM
koff
s-1
kon
M-1s-1
pHTemp
°C
Cdc7 Kinase
(Homo sapiens (Human))
BDBM50329444
(5-(2-Amino-pyrimidin-4-yl)-2-pyridin-2-yl-1H-pyrro...)
Show SMILES NC(=O)c1cc([nH]c1-c1ccccn1)-c1ccnc(N)n1
Show InChI InChI=1S/C14H12N6O/c15-13(21)8-7-11(9-4-6-18-14(16)20-9)19-12(8)10-3-1-2-5-17-10/h1-7,19H,(H2,15,21)(H2,16,18,20)
Reactome pathway
US Patent
n/an/a<1.00E+3n/an/an/an/an/an/a
NERVIANO MEDICAL SCIENCES S.R.L.
US Patent
Assay Description
The assay consists of the transfer of radioactivity labeled phosphate moiety by the kinase to an acceptor substrate. The resulting 33P-labeled produc...
US Patent US9670191 (2017)
BindingDB Entry DOI: 10.7270/Q2X63K3K
Cell division cycle 7-related protein kinase
(Homo sapiens (Human))
BDBM50329444
(5-(2-Amino-pyrimidin-4-yl)-2-pyridin-2-yl-1H-pyrro...)
Show SMILES NC(=O)c1cc([nH]c1-c1ccccn1)-c1ccnc(N)n1
Show InChI InChI=1S/C14H12N6O/c15-13(21)8-7-11(9-4-6-18-14(16)20-9)19-12(8)10-3-1-2-5-17-10/h1-7,19H,(H2,15,21)(H2,16,18,20)
Reactome pathway
n/an/a 412n/an/an/an/an/an/a
Nerviano Medical Sciences Srl
Curated by ChEMBL
Assay Description
Inhibition of Cdc7
J Med Chem 53: 7296-315 (2010)
Article DOI: 10.1021/jm100504d
BindingDB Entry DOI: 10.7270/Q24T6JM3