BDBM50329448 5-(2-Amino-pyrimidin-4-yl)-2-naphthalen-2-yl-1H-pyrrole-3-carboxamide::CHEMBL1271129::US9670191, F6
SMILES: NC(=O)c1cc([nH]c1-c1ccc2ccccc2c1)-c1ccnc(N)n1
InChI Key: InChIKey=AENKWOUTNGXJPR-UHFFFAOYSA-N
Data: 2 IC50
Activity Spreadsheet -- Enzyme Inhibition Constant Data from BindingDB
Found 2 hits for monomerid = 50329448
Trg + Lig
Ki
nM
ΔG°
kcal/mole
IC50
nM
Kd
nM
EC50/IC50
nM
koff
s-1
kon
M-1s-1
pHTemp
°C
Cdc7 Kinase
(Homo sapiens (Human))
BDBM50329448
(5-(2-Amino-pyrimidin-4-yl)-2-naphthalen-2-yl-1H-py...)
Show SMILES NC(=O)c1cc([nH]c1-c1ccc2ccccc2c1)-c1ccnc(N)n1
Show InChI InChI=1S/C19H15N5O/c20-18(25)14-10-16(15-7-8-22-19(21)24-15)23-17(14)13-6-5-11-3-1-2-4-12(11)9-13/h1-10,23H,(H2,20,25)(H2,21,22,24)
Reactome pathway
US Patent
n/an/a<1.00E+3n/an/an/an/an/an/a
NERVIANO MEDICAL SCIENCES S.R.L.
US Patent
Assay Description
The assay consists of the transfer of radioactivity labeled phosphate moiety by the kinase to an acceptor substrate. The resulting 33P-labeled produc...
US Patent US9670191 (2017)
BindingDB Entry DOI: 10.7270/Q2X63K3K
Cell division cycle 7-related protein kinase
(Homo sapiens (Human))
BDBM50329448
(5-(2-Amino-pyrimidin-4-yl)-2-naphthalen-2-yl-1H-py...)
Show SMILES NC(=O)c1cc([nH]c1-c1ccc2ccccc2c1)-c1ccnc(N)n1
Show InChI InChI=1S/C19H15N5O/c20-18(25)14-10-16(15-7-8-22-19(21)24-15)23-17(14)13-6-5-11-3-1-2-4-12(11)9-13/h1-10,23H,(H2,20,25)(H2,21,22,24)
Reactome pathway
n/an/a 269n/an/an/an/an/an/a
Nerviano Medical Sciences Srl
Curated by ChEMBL
Assay Description
Inhibition of Cdc7
J Med Chem 53: 7296-315 (2010)
Article DOI: 10.1021/jm100504d
BindingDB Entry DOI: 10.7270/Q24T6JM3