BDBM50329800 (Z)-3-((4-(2-(dimethylamino)-N-methylacetamido)phenylamino)(phenyl)methylene)-N-ethyl-2-oxoindoline-6-carboxamide::CHEMBL1272290
SMILES: CCNC(=O)c1ccc2C(C(=Nc3ccc(cc3)N(C)C(=O)CN(C)C)c3ccccc3)C(=O)Nc2c1
InChI Key: InChIKey=GUDFYAAWBWHCJA-UHFFFAOYSA-N
Data: 2 IC50  1 EC50
Activity Spreadsheet -- Enzyme Inhibition Constant Data from BindingDB
Found 3 hits for monomerid = 50329800
Trg + Lig
Ki
nM
ΔG°
kcal/mole
IC50
nM
Kd
nM
EC50/IC50
nM
koff
s-1
kon
M-1s-1
pHTemp
°C
TGF-beta receptor type-1
(Homo sapiens (Human))
BDBM50329800
((Z)-3-((4-(2-(dimethylamino)-N-methylacetamido)phe...)
Show SMILES CCNC(=O)c1ccc2C(C(=Nc3ccc(cc3)N(C)C(=O)CN(C)C)c3ccccc3)C(=O)Nc2c1 |w:11.11|
Show InChI InChI=1S/C29H31N5O3/c1-5-30-28(36)20-11-16-23-24(17-20)32-29(37)26(23)27(19-9-7-6-8-10-19)31-21-12-14-22(15-13-21)34(4)25(35)18-33(2)3/h6-17,26H,5,18H2,1-4H3,(H,30,36)(H,32,37)
n/an/an/an/a 3.38E+3n/an/an/an/a
Boehringer Ingelheim Pharma GmbH& Co KG
Curated by ChEMBL
Assay Description
Inhibition of TGFbeta receptor in human HaCaT cells assessed as Smad phosphorylation by ELISA
J Med Chem 53: 7287-95 (2010)
Article DOI: 10.1021/jm100812a
BindingDB Entry DOI: 10.7270/Q2F47PCW
Platelet-derived growth factor receptor alpha
(Homo sapiens (Human))
BDBM50329800
((Z)-3-((4-(2-(dimethylamino)-N-methylacetamido)phe...)
Show SMILES CCNC(=O)c1ccc2C(C(=Nc3ccc(cc3)N(C)C(=O)CN(C)C)c3ccccc3)C(=O)Nc2c1 |w:11.11|
Show InChI InChI=1S/C29H31N5O3/c1-5-30-28(36)20-11-16-23-24(17-20)32-29(37)26(23)27(19-9-7-6-8-10-19)31-21-12-14-22(15-13-21)34(4)25(35)18-33(2)3/h6-17,26H,5,18H2,1-4H3,(H,30,36)(H,32,37)
n/an/a 137n/an/an/an/an/an/a
Boehringer Ingelheim Pharma GmbH& Co KG
Curated by ChEMBL
Assay Description
Inhibition of PDGFRalpha
J Med Chem 53: 7287-95 (2010)
Article DOI: 10.1021/jm100812a
BindingDB Entry DOI: 10.7270/Q2F47PCW
TGF-beta receptor type-1
(Homo sapiens (Human))
BDBM50329800
((Z)-3-((4-(2-(dimethylamino)-N-methylacetamido)phe...)
Show SMILES CCNC(=O)c1ccc2C(C(=Nc3ccc(cc3)N(C)C(=O)CN(C)C)c3ccccc3)C(=O)Nc2c1 |w:11.11|
Show InChI InChI=1S/C29H31N5O3/c1-5-30-28(36)20-11-16-23-24(17-20)32-29(37)26(23)27(19-9-7-6-8-10-19)31-21-12-14-22(15-13-21)34(4)25(35)18-33(2)3/h6-17,26H,5,18H2,1-4H3,(H,30,36)(H,32,37)
n/an/a 35n/an/an/an/an/an/a
Boehringer Ingelheim Pharma GmbH& Co KG
Curated by ChEMBL
Assay Description
Inhibition of TGFbeta receptor
J Med Chem 53: 7287-95 (2010)
Article DOI: 10.1021/jm100812a
BindingDB Entry DOI: 10.7270/Q2F47PCW