BDBM50330012 ((3R,5R)-5-tert-butyl-4-(4-chlorophenylsulfonyl)morpholin-3-yl)methyl 4-(1-hydroxy-2-methylpropan-2-yl)piperazine-1-carboxylate::CHEMBL1271704
SMILES: CC(C)(C)[C@@H]1COC[C@H](COC(=O)N2CCN(CC2)C(C)(C)CO)N1S(=O)(=O)c1ccc(Cl)cc1
InChI Key: InChIKey=VQOLUEFEGFCAIH-CTNGQTDRSA-N
Data: 1 IC50
Activity Spreadsheet -- Enzyme Inhibition Constant Data from BindingDB
Found 1 hit for monomerid = 50330012
Trg + Lig
Ki
nM
ΔG°
kcal/mole
IC50
nM
Kd
nM
EC50/IC50
nM
koff
s-1
kon
M-1s-1
pHTemp
°C
Cytochrome P450 3A4
(Homo sapiens (Human))
BDBM50330012
(((3R,5R)-5-tert-butyl-4-(4-chlorophenylsulfonyl)mo...)
Show SMILES CC(C)(C)[C@@H]1COC[C@H](COC(=O)N2CCN(CC2)C(C)(C)CO)N1S(=O)(=O)c1ccc(Cl)cc1 |r|
Show InChI InChI=1S/C24H38ClN3O6S/c1-23(2,3)21-16-33-14-19(28(21)35(31,32)20-8-6-18(25)7-9-20)15-34-22(30)26-10-12-27(13-11-26)24(4,5)17-29/h6-9,19,21,29H,10-17H2,1-5H3/t19-,21+/m1/s1
Reactome pathway
n/an/a 23.8n/an/an/an/an/an/a
Merck Research Lab.
Curated by ChEMBL
Assay Description
Inhibition of CYP3A4 after 30 mins
Bioorg Med Chem Lett 20: 6606-9 (2010)
Article DOI: 10.1016/j.bmcl.2010.09.028
BindingDB Entry DOI: 10.7270/Q2RF5V79