BDBM50330027 1-((3R,5R)-4-(4-chlorophenylsulfonyl)-5-(cyclopropylmethyl)morpholin-3-yl)cyclopropyl1-methyl-1,7-diazaspiro[3.5]nonane-7-carboxylate::CHEMBL1272207
SMILES: CN1CCC11CCN(CC1)C(=O)OC1(CC1)[C@H]1COC[C@@H](CC2CC2)N1S(=O)(=O)c1ccc(Cl)cc1
InChI Key: InChIKey=JGLTVCVKQGVHKR-FYYLOGMGSA-N
Data: 1 IC50
Activity Spreadsheet -- Enzyme Inhibition Constant Data from BindingDB
Found 1 hit for monomerid = 50330027
Trg + Lig
Ki
nM
ΔG°
kcal/mole
IC50
nM
Kd
nM
EC50/IC50
nM
koff
s-1
kon
M-1s-1
pHTemp
°C
Cytochrome P450 3A4
(Homo sapiens (Human))
BDBM50330027
(1-((3R,5R)-4-(4-chlorophenylsulfonyl)-5-(cycloprop...)
Show SMILES CN1CCC11CCN(CC1)C(=O)OC1(CC1)[C@H]1COC[C@@H](CC2CC2)N1S(=O)(=O)c1ccc(Cl)cc1 |r|
Show InChI InChI=1S/C26H36ClN3O5S/c1-28-13-10-25(28)11-14-29(15-12-25)24(31)35-26(8-9-26)23-18-34-17-21(16-19-2-3-19)30(23)36(32,33)22-6-4-20(27)5-7-22/h4-7,19,21,23H,2-3,8-18H2,1H3/t21-,23-/m1/s1
Reactome pathway
n/an/a 30n/an/an/an/an/an/a
Merck Research Lab.
Curated by ChEMBL
Assay Description
Inhibition of CYP3A4 after 30 mins
Bioorg Med Chem Lett 20: 6606-9 (2010)
Article DOI: 10.1016/j.bmcl.2010.09.028
BindingDB Entry DOI: 10.7270/Q2RF5V79