BDBM50330190 (3S,6S,9S,12R,15S,18S,21S,24S,30S,33S)-12-(4-aminobutyl)-30-ethyl-33-((1R,2R)-1-hydroxy-2-methylhex-4-enyl)-6,9,18,24-tetraisobutyl-3,21-diisopropyl-1,4,7,10,15,19,25,28-octamethyl-1,4,7,10,13,16,19,22,25,28,31-undecaazacyclotritriacontan-2,5,8,11,14,17,20,23,26,29,32-undecaone::CHEMBL1269588
SMILES: CC[C@@H]1NC(=O)[C@H]([C@H](O)[C@H](C)C\C=C\C)N(C)C(=O)[C@H](C(C)C)N(C)C(=O)[C@H](CC(C)C)N(C)C(=O)[C@H](CC(C)C)N(C)C(=O)[C@@H](CCCCN)NC(=O)[C@H](C)NC(=O)[C@H](CC(C)C)N(C)C(=O)[C@@H](NC(=O)[C@H](CC(C)C)N(C)C(=O)CN(C)C1=O)C(C)C
InChI Key: InChIKey=GBAVOQOMIYSWGW-JHWHNHJXSA-N
Data: 2 IC50
Activity Spreadsheet -- Enzyme Inhibition Constant Data from BindingDB
Found 2 hits for monomerid = 50330190
Trg + Lig
Ki
nM
ΔG°
kcal/mole
IC50
nM
Kd
nM
EC50/IC50
nM
koff
s-1
kon
M-1s-1
pHTemp
°C
Cyclophilin B (CypB)
(Homo sapiens (Human))
BDBM50330190
((3S,6S,9S,12R,15S,18S,21S,24S,30S,33S)-12-(4-amino...)
Show SMILES CC[C@@H]1NC(=O)[C@H]([C@H](O)[C@H](C)C\C=C\C)N(C)C(=O)[C@H](C(C)C)N(C)C(=O)[C@H](CC(C)C)N(C)C(=O)[C@H](CC(C)C)N(C)C(=O)[C@@H](CCCCN)NC(=O)[C@H](C)NC(=O)[C@H](CC(C)C)N(C)C(=O)[C@@H](NC(=O)[C@H](CC(C)C)N(C)C(=O)CN(C)C1=O)C(C)C |r|
Show InChI InChI=1S/C65H118N12O12/c1-24-26-29-43(15)55(79)54-59(83)68-45(25-2)60(84)71(17)36-51(78)72(18)47(32-37(3)4)58(82)70-52(41(11)12)64(88)73(19)48(33-38(5)6)57(81)67-44(16)56(80)69-46(30-27-28-31-66)61(85)74(20)49(34-39(7)8)62(86)75(21)50(35-40(9)10)63(87)76(22)53(42(13)14)65(89)77(54)23/h24,26,37-50,52-55,79H,25,27-36,66H2,1-23H3,(H,67,81)(H,68,83)(H,69,80)(H,70,82)/b26-24+/t43-,44+,45+,46-,47+,48+,49+,50+,52+,53+,54+,55-/m1/s1
Reactome pathway
n/an/a 12.7n/an/an/an/an/an/a
SCYNEXIS, Inc.
Curated by ChEMBL
Assay Description
Binding affinity to cyclophilin B by ELISA
Bioorg Med Chem Lett 20: 6542-6 (2010)
Article DOI: 10.1016/j.bmcl.2010.09.036
BindingDB Entry DOI: 10.7270/Q2M909NJ
Peptidyl-prolyl cis-trans isomerase A
(Homo sapiens (Human))
BDBM50330190
((3S,6S,9S,12R,15S,18S,21S,24S,30S,33S)-12-(4-amino...)
Show SMILES CC[C@@H]1NC(=O)[C@H]([C@H](O)[C@H](C)C\C=C\C)N(C)C(=O)[C@H](C(C)C)N(C)C(=O)[C@H](CC(C)C)N(C)C(=O)[C@H](CC(C)C)N(C)C(=O)[C@@H](CCCCN)NC(=O)[C@H](C)NC(=O)[C@H](CC(C)C)N(C)C(=O)[C@@H](NC(=O)[C@H](CC(C)C)N(C)C(=O)CN(C)C1=O)C(C)C |r|
Show InChI InChI=1S/C65H118N12O12/c1-24-26-29-43(15)55(79)54-59(83)68-45(25-2)60(84)71(17)36-51(78)72(18)47(32-37(3)4)58(82)70-52(41(11)12)64(88)73(19)48(33-38(5)6)57(81)67-44(16)56(80)69-46(30-27-28-31-66)61(85)74(20)49(34-39(7)8)62(86)75(21)50(35-40(9)10)63(87)76(22)53(42(13)14)65(89)77(54)23/h24,26,37-50,52-55,79H,25,27-36,66H2,1-23H3,(H,67,81)(H,68,83)(H,69,80)(H,70,82)/b26-24+/t43-,44+,45+,46-,47+,48+,49+,50+,52+,53+,54+,55-/m1/s1
Reactome pathway
n/an/a 11.1n/an/an/an/an/an/a
SCYNEXIS, Inc.
Curated by ChEMBL
Assay Description
Binding affinity to cyclophilin A by ELISA
Bioorg Med Chem Lett 20: 6542-6 (2010)
Article DOI: 10.1016/j.bmcl.2010.09.036
BindingDB Entry DOI: 10.7270/Q2M909NJ