BDBM50330312 (3R,4S,5R,6S)-6-(8-chloro-3-cinnamamido-4-hydroxy-2-oxo-2H-chromen-7-yloxy)-5-hydroxy-3-methoxy-2,2-dimethyltetrahydro-2H-pyran-4-yl 5-methyl-1H-pyrrole-2-carboxylate::CHEMBL1275846
SMILES: CO[C@@H]1[C@@H](OC(=O)c2ccc(C)[nH]2)[C@@H](O)[C@H](Oc2ccc3c(O)c(NC(=O)\C=C\c4ccccc4)c(=O)oc3c2Cl)OC1(C)C
InChI Key: InChIKey=YRPQLLNDNYAISI-SNVNZYQNSA-N
Data: 2 IC50
Activity Spreadsheet -- Enzyme Inhibition Constant Data from BindingDB
Found 2 hits for monomerid = 50330312
Trg + Lig
Ki
nM
ΔG°
kcal/mole
IC50
nM
Kd
nM
EC50/IC50
nM
koff
s-1
kon
M-1s-1
pHTemp
°C
DNA Gyrase Subunit B
(Escherichia coli (strain K12))
BDBM50330312
((3R,4S,5R,6S)-6-(8-chloro-3-cinnamamido-4-hydroxy-...)
Show SMILES CO[C@@H]1[C@@H](OC(=O)c2ccc(C)[nH]2)[C@@H](O)[C@H](Oc2ccc3c(O)c(NC(=O)\C=C\c4ccccc4)c(=O)oc3c2Cl)OC1(C)C |r|
Show InChI InChI=1S/C32H31ClN2O10/c1-16-10-13-19(34-16)29(39)44-27-25(38)31(45-32(2,3)28(27)41-4)42-20-14-12-18-24(37)23(30(40)43-26(18)22(20)33)35-21(36)15-11-17-8-6-5-7-9-17/h5-15,25,27-28,31,34,37-38H,1-4H3,(H,35,36)/b15-11+/t25-,27+,28-,31-/m1/s1
n/an/a 34n/an/an/an/an/an/a
Universität Tübingen
Curated by ChEMBL
Assay Description
Inhibition of Escherichia coli JM109 DNA gyrase subunit B assessed as DNA triple helix formation by supercoiling assay
Antimicrob Agents Chemother 52: 1982-90 (2008)
Article DOI: 10.1128/AAC.01235-07
BindingDB Entry DOI: 10.7270/Q2PG1S0J
DNA Gyrase Subunit B
(Escherichia coli (strain K12))
BDBM50330312
((3R,4S,5R,6S)-6-(8-chloro-3-cinnamamido-4-hydroxy-...)
Show SMILES CO[C@@H]1[C@@H](OC(=O)c2ccc(C)[nH]2)[C@@H](O)[C@H](Oc2ccc3c(O)c(NC(=O)\C=C\c4ccccc4)c(=O)oc3c2Cl)OC1(C)C |r|
Show InChI InChI=1S/C32H31ClN2O10/c1-16-10-13-19(34-16)29(39)44-27-25(38)31(45-32(2,3)28(27)41-4)42-20-14-12-18-24(37)23(30(40)43-26(18)22(20)33)35-21(36)15-11-17-8-6-5-7-9-17/h5-15,25,27-28,31,34,37-38H,1-4H3,(H,35,36)/b15-11+/t25-,27+,28-,31-/m1/s1
n/an/a 90n/an/an/an/an/an/a
Universität Tübingen
Curated by ChEMBL
Assay Description
Inhibition of Escherichia coli JM109 DNA gyrase subunit B assessed as ATP hydrolysis by ATPase assay
Antimicrob Agents Chemother 52: 1982-90 (2008)
Article DOI: 10.1128/AAC.01235-07
BindingDB Entry DOI: 10.7270/Q2PG1S0J