BDBM50330343 (R)-methyl 1-((5S,6S,8R)-5-amino-9-(butylamino)-6-hydroxy-3,3,8-trimethyl-9-oxononanoyl)-1,2,3,4-tetrahydroquinoline-3-carboxylate::CHEMBL1231601::METHYL (3R)-1-[(5S,6S,8R)-5-AMINO-9-BUTYLAMINO-6-HYDROXY-3,3,8-TRIMETHYL-9-OXO-NONANOYL]-3,4-DIHYDRO-2H-QUINOLINE-3-CARBOXYLATE
SMILES: CCCCNC(=O)[C@H](C)C[C@H](O)[C@@H](N)CC(C)(C)CC(=O)N1C[C@@H](Cc2ccccc12)C(=O)OC
InChI Key: InChIKey=VROPGBJWKDHPPG-WQJYWUQFSA-N
Data: 1 IC50
PDB links: 1 PDB ID matches this monomer.
Activity Spreadsheet -- Enzyme Inhibition Constant Data from BindingDB
Found 1 hit for monomerid = 50330343
Trg + Lig
Ki
nM
ΔG°
kcal/mole
IC50
nM
Kd
nM
EC50/IC50
nM
koff
s-1
kon
M-1s-1
pHTemp
°C
Renin
(Homo sapiens (Human))
BDBM50330343
((R)-methyl 1-((5S,6S,8R)-5-amino-9-(butylamino)-6-...)
Show SMILES CCCCNC(=O)[C@H](C)C[C@H](O)[C@@H](N)CC(C)(C)CC(=O)N1C[C@@H](Cc2ccccc12)C(=O)OC |r|
Show InChI InChI=1S/C27H43N3O5/c1-6-7-12-29-25(33)18(2)13-23(31)21(28)15-27(3,4)16-24(32)30-17-20(26(34)35-5)14-19-10-8-9-11-22(19)30/h8-11,18,20-21,23,31H,6-7,12-17,28H2,1-5H3,(H,29,33)/t18-,20-,21+,23+/m1/s1
Reactome pathway
n/an/a 0.800n/an/an/an/an/an/a
Novartis Pharmaceuticals Corp
Curated by ChEMBL
Assay Description
Inhibition of human recombinant renin in buffer
J Med Chem 53: 7490-520 (2010)
Article DOI: 10.1021/jm901885s
BindingDB Entry DOI: 10.7270/Q2S75GKG
3D
3D Structure (crystal)