BDBM50330456 7-Acetyl-3-amino-2-[4-(4-quinolin-2-ylpiperazin-1-yl)butyl]-5, 6,7,8-tetrahydro-3H-pyrido[4',3':4,5]thieno[2,3-d]pyrimidin-4-one::CHEMBL1276922
SMILES: CC(=O)N1CCc2c(C1)sc1nc(CCCCN3CCN(CC3)c3ccc4ccccc4n3)n(N)c(=O)c21
InChI Key: InChIKey=MLNBDGCWHJVZAI-UHFFFAOYSA-N
Data: 1 IC50
Activity Spreadsheet -- Enzyme Inhibition Constant Data from BindingDB
Found 1 hit for monomerid = 50330456
Trg + Lig
Ki
nM
ΔG°
kcal/mole
IC50
nM
Kd
nM
EC50/IC50
nM
koff
s-1
kon
M-1s-1
pHTemp
°C
5-hydroxytryptamine receptor 3A
(Homo sapiens (Human))
BDBM50330456
(7-Acetyl-3-amino-2-[4-(4-quinolin-2-ylpiperazin-1-...)
Show SMILES CC(=O)N1CCc2c(C1)sc1nc(CCCCN3CCN(CC3)c3ccc4ccccc4n3)n(N)c(=O)c21
Show InChI InChI=1S/C28H33N7O2S/c1-19(36)34-13-11-21-23(18-34)38-27-26(21)28(37)35(29)25(31-27)8-4-5-12-32-14-16-33(17-15-32)24-10-9-20-6-2-3-7-22(20)30-24/h2-3,6-7,9-10H,4-5,8,11-18,29H2,1H3
Reactome pathway
n/an/a 22.1n/an/an/an/an/an/a
ASKA Pharmaceutical Co, Ltd
Curated by ChEMBL
Assay Description
Displacement of [3H]BRL-43694 from human 5HT3 receptor expressed in HEK293 cells by liquid scintillation counting
J Med Chem 53: 7549-63 (2010)
Article DOI: 10.1021/jm1002292
BindingDB Entry DOI: 10.7270/Q27082D1