BDBM50330464 3-Amino-6-hydroxy-2-[4-(4-quinolin-2-ylpiperazin-1-yl)butyl]-5,6,7,8-tetrahydro-3H-quinazolin-4-one::CHEMBL1276921
SMILES: Nn1c(CCCCN2CCN(CC2)c2ccc3ccccc3n2)nc2CCC(O)Cc2c1=O
InChI Key: InChIKey=ZNOMCTSKVJJIMN-UHFFFAOYSA-N
Data: 1 IC50
Activity Spreadsheet -- Enzyme Inhibition Constant Data from BindingDB
Found 1 hit for monomerid = 50330464
Trg + Lig
Ki
nM
ΔG°
kcal/mole
IC50
nM
Kd
nM
EC50/IC50
nM
koff
s-1
kon
M-1s-1
pHTemp
°C
5-hydroxytryptamine receptor 3A
(Homo sapiens (Human))
BDBM50330464
(3-Amino-6-hydroxy-2-[4-(4-quinolin-2-ylpiperazin-1...)
Show SMILES Nn1c(CCCCN2CCN(CC2)c2ccc3ccccc3n2)nc2CCC(O)Cc2c1=O
Show InChI InChI=1S/C25H32N6O2/c26-31-24(28-22-10-9-19(32)17-20(22)25(31)33)7-3-4-12-29-13-15-30(16-14-29)23-11-8-18-5-1-2-6-21(18)27-23/h1-2,5-6,8,11,19,32H,3-4,7,9-10,12-17,26H2
Reactome pathway
n/an/a 46.5n/an/an/an/an/an/a
ASKA Pharmaceutical Co, Ltd
Curated by ChEMBL
Assay Description
Displacement of [3H]BRL-43694 from human 5HT3 receptor expressed in HEK293 cells by liquid scintillation counting
J Med Chem 53: 7549-63 (2010)
Article DOI: 10.1021/jm1002292
BindingDB Entry DOI: 10.7270/Q27082D1