BDBM50330527 1-methyl-3-(phenylsulfonyl)-5-(piperazin-1-yl)-1H-indazole::CHEMBL1278092
SMILES: Cn1nc(c2cc(ccc12)N1CCNCC1)S(=O)(=O)c1ccccc1
InChI Key: InChIKey=RSVABANYROVMSW-UHFFFAOYSA-N
Data: 1 KI  1 IC50
Activity Spreadsheet -- Enzyme Inhibition Constant Data from BindingDB
Found 2 hits for monomerid = 50330527
Trg + Lig
Ki
nM
ΔG°
kcal/mole
IC50
nM
Kd
nM
EC50/IC50
nM
koff
s-1
kon
M-1s-1
pHTemp
°C
5-hydroxytryptamine receptor 6
(Homo sapiens (Human))
BDBM50330527
(1-methyl-3-(phenylsulfonyl)-5-(piperazin-1-yl)-1H-...)
Show SMILES Cn1nc(c2cc(ccc12)N1CCNCC1)S(=O)(=O)c1ccccc1
Show InChI InChI=1S/C18H20N4O2S/c1-21-17-8-7-14(22-11-9-19-10-12-22)13-16(17)18(20-21)25(23,24)15-5-3-2-4-6-15/h2-8,13,19H,9-12H2,1H3
Reactome pathway
3.20n/an/an/an/an/an/an/an/a
Wyeth Research
Curated by ChEMBL
Assay Description
Displacement of [3H]LSD from human cloned 5HT6 receptor expressed in human HeLa cells
J Med Chem 53: 7639-46 (2010)
Article DOI: 10.1021/jm1007825
BindingDB Entry DOI: 10.7270/Q2GQ6XZ6
5-hydroxytryptamine receptor 6
(Homo sapiens (Human))
BDBM50330527
(1-methyl-3-(phenylsulfonyl)-5-(piperazin-1-yl)-1H-...)
Show SMILES Cn1nc(c2cc(ccc12)N1CCNCC1)S(=O)(=O)c1ccccc1
Show InChI InChI=1S/C18H20N4O2S/c1-21-17-8-7-14(22-11-9-19-10-12-22)13-16(17)18(20-21)25(23,24)15-5-3-2-4-6-15/h2-8,13,19H,9-12H2,1H3
Reactome pathway
n/an/a 3.20n/an/an/an/an/an/a
Wyeth Research
Curated by ChEMBL
Assay Description
Antagonist activity at human cloned 5HT6 receptor expressed in human HeLa cells by cyclase assay
J Med Chem 53: 7639-46 (2010)
Article DOI: 10.1021/jm1007825
BindingDB Entry DOI: 10.7270/Q2GQ6XZ6