BDBM50331088 CHEMBL1290031
SMILES: O=C(Nc1ccc(Oc2ncnc3sc4CCCCc4c23)cc1)c1ccccc1
InChI Key: InChIKey=KZCKXQNZBWNDPM-UHFFFAOYSA-N
Data: 1 IC50
Activity Spreadsheet -- Enzyme Inhibition Constant Data from BindingDB
Found 1 hit for monomerid = 50331088
Trg + Lig
Ki
nM
ΔG°
kcal/mole
IC50
nM
Kd
nM
EC50/IC50
nM
koff
s-1
kon
M-1s-1
pHTemp
°C
Vascular endothelial growth factor receptor 2
(Homo sapiens (Human))
BDBM50331088
(CHEMBL1290031)
Show SMILES O=C(Nc1ccc(Oc2ncnc3sc4CCCCc4c23)cc1)c1ccccc1
Show InChI InChI=1S/C23H19N3O2S/c27-21(15-6-2-1-3-7-15)26-16-10-12-17(13-11-16)28-22-20-18-8-4-5-9-19(18)29-23(20)25-14-24-22/h1-3,6-7,10-14H,4-5,8-9H2,(H,26,27)
NCI pathway
Reactome pathway
n/an/a 4.10n/an/an/an/an/an/a
Konkuk University
Curated by ChEMBL
Assay Description
Inhibition of recombinant VEGFR2 after 1 hr by fluorescence polarization assay
Eur J Med Chem 45: 5420-7 (2010)
Article DOI: 10.1016/j.ejmech.2010.09.002
BindingDB Entry DOI: 10.7270/Q2TX3FMZ