BDBM50331281 3-(4-bromo-1H-indol-2-yl)-1H-pyrazolo[4,3-b]pyridine::CHEMBL1288611
SMILES: Brc1cccc2[nH]c(cc12)-c1n[nH]c2cccnc12
InChI Key: InChIKey=OCRRPOVPOGWRDX-UHFFFAOYSA-N
Data: 1 IC50
Activity Spreadsheet -- Enzyme Inhibition Constant Data from BindingDB
Found 1 hit for monomerid = 50331281
Trg + Lig
Ki
nM
ΔG°
kcal/mole
IC50
nM
Kd
nM
EC50/IC50
nM
koff
s-1
kon
M-1s-1
pHTemp
°C
Tyrosine-protein kinase ITK/TSK
(Homo sapiens (Human))
BDBM50331281
(3-(4-bromo-1H-indol-2-yl)-1H-pyrazolo[4,3-b]pyridi...)
Show SMILES Brc1cccc2[nH]c(cc12)-c1n[nH]c2cccnc12
Show InChI InChI=1S/C14H9BrN4/c15-9-3-1-4-10-8(9)7-12(17-10)14-13-11(18-19-14)5-2-6-16-13/h1-7,17H,(H,18,19)
Reactome pathway
n/an/a 240n/an/an/an/an/an/a
Nycomed GmbH
Curated by ChEMBL
Assay Description
Inhibition of recombinant GST- tagged full-length ITK expressed in baculovirus expression system after 30 mins by scintillation proximity assay
Bioorg Med Chem Lett 20: 6998-7003 (2010)
Article DOI: 10.1016/j.bmcl.2010.09.119
BindingDB Entry DOI: 10.7270/Q2JD4X29