BDBM50331392 CHEMBL4163988
SMILES: NCc1cccc(Nc2nc(N[C@H]3CCCC[C@H]3C(O)=O)nc3ccccc23)c1
InChI Key: InChIKey=HGCXJWRMCKMKEG-MJGOQNOKSA-N
Data: 1 IC50  1 Kd
PDB links: 1 PDB ID matches this monomer.
Activity Spreadsheet -- Enzyme Inhibition Constant Data from BindingDB
Found 2 hits for monomerid = 50331392
Trg + Lig
Ki
nM
ΔG°
kcal/mole
IC50
nM
Kd
nM
EC50/IC50
nM
koff
s-1
kon
M-1s-1
pHTemp
°C
Complement factor D
(Homo sapiens (Human))
BDBM50331392
(CHEMBL4163988)
Show SMILES NCc1cccc(Nc2nc(N[C@H]3CCCC[C@H]3C(O)=O)nc3ccccc23)c1 |r|
Show InChI InChI=1S/C22H25N5O2/c23-13-14-6-5-7-15(12-14)24-20-16-8-1-3-10-18(16)25-22(27-20)26-19-11-4-2-9-17(19)21(28)29/h1,3,5-8,10,12,17,19H,2,4,9,11,13,23H2,(H,28,29)(H2,24,25,26,27)/t17-,19+/m1/s1
n/an/a 8.40E+4n/an/an/an/an/an/a
Novartis Pharma AG
Curated by ChEMBL
Assay Description
Displacement of 19F[(S)-methyl 2-((2-(3-(trifluoromethoxy)phenylcarbamoyl)pyrrolidine-1-carboxamido)methyl)benzoate] from complement factor D (unknow...
ACS Med Chem Lett 9: 490-495 (2018)
Article DOI: 10.1021/acsmedchemlett.8b00104
BindingDB Entry DOI: 10.7270/Q2K35X6P
3D
3D Structure (crystal)
Complement factor D
(Homo sapiens (Human))
BDBM50331392
(CHEMBL4163988)
Show SMILES NCc1cccc(Nc2nc(N[C@H]3CCCC[C@H]3C(O)=O)nc3ccccc23)c1 |r|
Show InChI InChI=1S/C22H25N5O2/c23-13-14-6-5-7-15(12-14)24-20-16-8-1-3-10-18(16)25-22(27-20)26-19-11-4-2-9-17(19)21(28)29/h1,3,5-8,10,12,17,19H,2,4,9,11,13,23H2,(H,28,29)(H2,24,25,26,27)/t17-,19+/m1/s1
n/an/an/a 3.50E+4n/an/an/an/an/a
Novartis Pharma AG
Curated by ChEMBL
Assay Description
Displacement of 19F[(S)-methyl 2-((2-(3-(trifluoromethoxy)phenylcarbamoyl)pyrrolidine-1-carboxamido)methyl)benzoate] from complement factor D (unknow...
ACS Med Chem Lett 9: 490-495 (2018)
Article DOI: 10.1021/acsmedchemlett.8b00104
BindingDB Entry DOI: 10.7270/Q2K35X6P
3D
3D Structure (crystal)