BDBM50331770 1-(4'-((S)-1-((S)-1-((S)-1-cyano-2-phenylethylamino)-4-fluoro-4-methyl-1-oxopentan-2-ylamino)-2,2,2-trifluoroethyl)biphenyl-4-yl)cyclopropanecarboxamide::CHEMBL1288525
SMILES: CC(C)(F)C[C@H](N[C@@H](c1ccc(cc1)-c1ccc(cc1)C1(CC1)C(N)=O)C(F)(F)F)C(=O)N[C@@H](Cc1ccccc1)C#N
InChI Key: InChIKey=ZUKNWGIRWRHHPH-KCHLEUMXSA-N
Data: 4 IC50
Activity Spreadsheet -- Enzyme Inhibition Constant Data from BindingDB
Found 4 hits for monomerid = 50331770
Trg + Lig
Ki
nM
ΔG°
kcal/mole
IC50
nM
Kd
nM
EC50/IC50
nM
koff
s-1
kon
M-1s-1
pHTemp
°C
Cathepsin F
(Homo sapiens (Human))
BDBM50331770
(1-(4'-((S)-1-((S)-1-((S)-1-cyano-2-phenylethylamin...)
Show SMILES CC(C)(F)C[C@H](N[C@@H](c1ccc(cc1)-c1ccc(cc1)C1(CC1)C(N)=O)C(F)(F)F)C(=O)N[C@@H](Cc1ccccc1)C#N |r|
Show InChI InChI=1S/C33H34F4N4O2/c1-31(2,34)19-27(29(42)40-26(20-38)18-21-6-4-3-5-7-21)41-28(33(35,36)37)24-10-8-22(9-11-24)23-12-14-25(15-13-23)32(16-17-32)30(39)43/h3-15,26-28,41H,16-19H2,1-2H3,(H2,39,43)(H,40,42)/t26-,27-,28-/m0/s1
Reactome pathway
n/an/a 37n/an/an/an/an/an/a
Merck Research Laboratories
Curated by ChEMBL
Assay Description
Inhibition of human Cat F expressed in rabbit HIG82 cells
Bioorg Med Chem Lett 20: 7444-9 (2010)
Article DOI: 10.1016/j.bmcl.2010.10.015
BindingDB Entry DOI: 10.7270/Q29S1R8D
Cathepsin B
(Homo sapiens (Human))
BDBM50331770
(1-(4'-((S)-1-((S)-1-((S)-1-cyano-2-phenylethylamin...)
Show SMILES CC(C)(F)C[C@H](N[C@@H](c1ccc(cc1)-c1ccc(cc1)C1(CC1)C(N)=O)C(F)(F)F)C(=O)N[C@@H](Cc1ccccc1)C#N |r|
Show InChI InChI=1S/C33H34F4N4O2/c1-31(2,34)19-27(29(42)40-26(20-38)18-21-6-4-3-5-7-21)41-28(33(35,36)37)24-10-8-22(9-11-24)23-12-14-25(15-13-23)32(16-17-32)30(39)43/h3-15,26-28,41H,16-19H2,1-2H3,(H2,39,43)(H,40,42)/t26-,27-,28-/m0/s1
Reactome pathway
n/an/a 27n/an/an/an/an/an/a
Merck Research Laboratories
Curated by ChEMBL
Assay Description
Inhibition of human Cat B in HepG2 cells
Bioorg Med Chem Lett 20: 7444-9 (2010)
Article DOI: 10.1016/j.bmcl.2010.10.015
BindingDB Entry DOI: 10.7270/Q29S1R8D
Cruzipain
(Trypanosoma cruzi)
BDBM50331770
(1-(4'-((S)-1-((S)-1-((S)-1-cyano-2-phenylethylamin...)
Show SMILES CC(C)(F)C[C@H](N[C@@H](c1ccc(cc1)-c1ccc(cc1)C1(CC1)C(N)=O)C(F)(F)F)C(=O)N[C@@H](Cc1ccccc1)C#N |r|
Show InChI InChI=1S/C33H34F4N4O2/c1-31(2,34)19-27(29(42)40-26(20-38)18-21-6-4-3-5-7-21)41-28(33(35,36)37)24-10-8-22(9-11-24)23-12-14-25(15-13-23)32(16-17-32)30(39)43/h3-15,26-28,41H,16-19H2,1-2H3,(H2,39,43)(H,40,42)/t26-,27-,28-/m0/s1
n/an/a 3n/an/an/an/an/an/a
Merck Research Laboratories
Curated by ChEMBL
Assay Description
Inhibition of trypanosoma cruzi Cruzipain
Bioorg Med Chem Lett 20: 7444-9 (2010)
Article DOI: 10.1016/j.bmcl.2010.10.015
BindingDB Entry DOI: 10.7270/Q29S1R8D
Procathepsin L
(Homo sapiens (Human))
BDBM50331770
(1-(4'-((S)-1-((S)-1-((S)-1-cyano-2-phenylethylamin...)
Show SMILES CC(C)(F)C[C@H](N[C@@H](c1ccc(cc1)-c1ccc(cc1)C1(CC1)C(N)=O)C(F)(F)F)C(=O)N[C@@H](Cc1ccccc1)C#N |r|
Show InChI InChI=1S/C33H34F4N4O2/c1-31(2,34)19-27(29(42)40-26(20-38)18-21-6-4-3-5-7-21)41-28(33(35,36)37)24-10-8-22(9-11-24)23-12-14-25(15-13-23)32(16-17-32)30(39)43/h3-15,26-28,41H,16-19H2,1-2H3,(H2,39,43)(H,40,42)/t26-,27-,28-/m0/s1
Reactome pathway
n/an/a 426n/an/an/an/an/an/a
Merck Research Laboratories
Curated by ChEMBL
Assay Description
Inhibition of human Cat L
Bioorg Med Chem Lett 20: 7444-9 (2010)
Article DOI: 10.1016/j.bmcl.2010.10.015
BindingDB Entry DOI: 10.7270/Q29S1R8D