BDBM50331783 (S)-N-((S)-1-cyano-3,3,3-trifluoropropyl)-4-fluoro-4-methyl-2-((S)-2,2,2-trifluoro-1-(4'-(methylsulfonyl)biphenyl-4-yl)ethylamino)pentanamide::CHEMBL1289553
SMILES: CC(C)(F)C[C@H](N[C@@H](c1ccc(cc1)-c1ccc(cc1)S(C)(=O)=O)C(F)(F)F)C(=O)N[C@@H](CC(F)(F)F)C#N
InChI Key: InChIKey=NNULPUWGQGOFSK-JBACZVJFSA-N
Data: 4 IC50
Activity Spreadsheet -- Enzyme Inhibition Constant Data from BindingDB
Found 4 hits for monomerid = 50331783
Trg + Lig
Ki
nM
ΔG°
kcal/mole
IC50
nM
Kd
nM
EC50/IC50
nM
koff
s-1
kon
M-1s-1
pHTemp
°C
Procathepsin L
(Homo sapiens (Human))
BDBM50331783
((S)-N-((S)-1-cyano-3,3,3-trifluoropropyl)-4-fluoro...)
Show SMILES CC(C)(F)C[C@H](N[C@@H](c1ccc(cc1)-c1ccc(cc1)S(C)(=O)=O)C(F)(F)F)C(=O)N[C@@H](CC(F)(F)F)C#N |r|
Show InChI InChI=1S/C25H26F7N3O3S/c1-23(2,26)13-20(22(36)34-18(14-33)12-24(27,28)29)35-21(25(30,31)32)17-6-4-15(5-7-17)16-8-10-19(11-9-16)39(3,37)38/h4-11,18,20-21,35H,12-13H2,1-3H3,(H,34,36)/t18-,20-,21-/m0/s1
Reactome pathway
n/an/a 2.63E+3n/an/an/an/an/an/a
Merck Research Laboratories
Curated by ChEMBL
Assay Description
Inhibition of human Cat L
Bioorg Med Chem Lett 20: 7444-9 (2010)
Article DOI: 10.1016/j.bmcl.2010.10.015
BindingDB Entry DOI: 10.7270/Q29S1R8D
Cathepsin F
(Homo sapiens (Human))
BDBM50331783
((S)-N-((S)-1-cyano-3,3,3-trifluoropropyl)-4-fluoro...)
Show SMILES CC(C)(F)C[C@H](N[C@@H](c1ccc(cc1)-c1ccc(cc1)S(C)(=O)=O)C(F)(F)F)C(=O)N[C@@H](CC(F)(F)F)C#N |r|
Show InChI InChI=1S/C25H26F7N3O3S/c1-23(2,26)13-20(22(36)34-18(14-33)12-24(27,28)29)35-21(25(30,31)32)17-6-4-15(5-7-17)16-8-10-19(11-9-16)39(3,37)38/h4-11,18,20-21,35H,12-13H2,1-3H3,(H,34,36)/t18-,20-,21-/m0/s1
Reactome pathway
n/an/a 654n/an/an/an/an/an/a
Merck Research Laboratories
Curated by ChEMBL
Assay Description
Inhibition of human Cat F expressed in rabbit HIG82 cells
Bioorg Med Chem Lett 20: 7444-9 (2010)
Article DOI: 10.1016/j.bmcl.2010.10.015
BindingDB Entry DOI: 10.7270/Q29S1R8D
Cathepsin B
(Homo sapiens (Human))
BDBM50331783
((S)-N-((S)-1-cyano-3,3,3-trifluoropropyl)-4-fluoro...)
Show SMILES CC(C)(F)C[C@H](N[C@@H](c1ccc(cc1)-c1ccc(cc1)S(C)(=O)=O)C(F)(F)F)C(=O)N[C@@H](CC(F)(F)F)C#N |r|
Show InChI InChI=1S/C25H26F7N3O3S/c1-23(2,26)13-20(22(36)34-18(14-33)12-24(27,28)29)35-21(25(30,31)32)17-6-4-15(5-7-17)16-8-10-19(11-9-16)39(3,37)38/h4-11,18,20-21,35H,12-13H2,1-3H3,(H,34,36)/t18-,20-,21-/m0/s1
Reactome pathway
n/an/a 668n/an/an/an/an/an/a
Merck Research Laboratories
Curated by ChEMBL
Assay Description
Inhibition of human Cat B in HepG2 cells
Bioorg Med Chem Lett 20: 7444-9 (2010)
Article DOI: 10.1016/j.bmcl.2010.10.015
BindingDB Entry DOI: 10.7270/Q29S1R8D
Cruzipain
(Trypanosoma cruzi)
BDBM50331783
((S)-N-((S)-1-cyano-3,3,3-trifluoropropyl)-4-fluoro...)
Show SMILES CC(C)(F)C[C@H](N[C@@H](c1ccc(cc1)-c1ccc(cc1)S(C)(=O)=O)C(F)(F)F)C(=O)N[C@@H](CC(F)(F)F)C#N |r|
Show InChI InChI=1S/C25H26F7N3O3S/c1-23(2,26)13-20(22(36)34-18(14-33)12-24(27,28)29)35-21(25(30,31)32)17-6-4-15(5-7-17)16-8-10-19(11-9-16)39(3,37)38/h4-11,18,20-21,35H,12-13H2,1-3H3,(H,34,36)/t18-,20-,21-/m0/s1
n/an/a 130n/an/an/an/an/an/a
Merck Research Laboratories
Curated by ChEMBL
Assay Description
Inhibition of trypanosoma cruzi Cruzipain
Bioorg Med Chem Lett 20: 7444-9 (2010)
Article DOI: 10.1016/j.bmcl.2010.10.015
BindingDB Entry DOI: 10.7270/Q29S1R8D