BDBM50332041 CHEMBL1288930::methyl 3-(2-phenylacetamido)thiophene-2-carboxylate
SMILES: COC(=O)c1sccc1NC(=O)Cc1ccccc1
InChI Key: InChIKey=YJXMVZWBSKFEBU-UHFFFAOYSA-N
Data: 3 IC50
Activity Spreadsheet -- Enzyme Inhibition Constant Data from BindingDB
Found 3 hits for monomerid = 50332041
Trg + Lig
Ki
nM
ΔG°
kcal/mole
IC50
nM
Kd
nM
EC50/IC50
nM
koff
s-1
kon
M-1s-1
pHTemp
°C
Mitogen-activated protein kinase 8
(Homo sapiens (Human))
BDBM50332041
(CHEMBL1288930 | methyl 3-(2-phenylacetamido)thioph...)
Show SMILES COC(=O)c1sccc1NC(=O)Cc1ccccc1
Show InChI InChI=1S/C14H13NO3S/c1-18-14(17)13-11(7-8-19-13)15-12(16)9-10-5-3-2-4-6-10/h2-8H,9H2,1H3,(H,15,16)
NCI pathway
Reactome pathway
n/an/a 700n/an/an/an/an/an/a
Elan Pharmaceuticals
Curated by ChEMBL
Assay Description
Inhibition of recombinant JNK1 after 60 mins by TR-FRET assay
Bioorg Med Chem Lett 20: 7303-7 (2010)
Article DOI: 10.1016/j.bmcl.2010.10.066
BindingDB Entry DOI: 10.7270/Q20865JW
Mitogen-activated protein kinase 10
(Homo sapiens (Human))
BDBM50332041
(CHEMBL1288930 | methyl 3-(2-phenylacetamido)thioph...)
Show SMILES COC(=O)c1sccc1NC(=O)Cc1ccccc1
Show InChI InChI=1S/C14H13NO3S/c1-18-14(17)13-11(7-8-19-13)15-12(16)9-10-5-3-2-4-6-10/h2-8H,9H2,1H3,(H,15,16)
NCI pathway
Reactome pathway
n/an/a 2.70E+3n/an/an/an/an/an/a
Elan Pharmaceuticals
Curated by ChEMBL
Assay Description
Inhibition of recombinant JNK3 after 60 mins by TR-FRET assay
Bioorg Med Chem Lett 20: 7303-7 (2010)
Article DOI: 10.1016/j.bmcl.2010.10.066
BindingDB Entry DOI: 10.7270/Q20865JW
Mitogen-activated protein kinase 9
(Homo sapiens (Human))
BDBM50332041
(CHEMBL1288930 | methyl 3-(2-phenylacetamido)thioph...)
Show SMILES COC(=O)c1sccc1NC(=O)Cc1ccccc1
Show InChI InChI=1S/C14H13NO3S/c1-18-14(17)13-11(7-8-19-13)15-12(16)9-10-5-3-2-4-6-10/h2-8H,9H2,1H3,(H,15,16)
NCI pathway
Reactome pathway
n/an/a 2.28E+4n/an/an/an/an/an/a
Elan Pharmaceuticals
Curated by ChEMBL
Assay Description
Inhibition of recombinant JNK2 after 60 mins by TR-FRET assay
Bioorg Med Chem Lett 20: 7303-7 (2010)
Article DOI: 10.1016/j.bmcl.2010.10.066
BindingDB Entry DOI: 10.7270/Q20865JW