BDBM50332047 CHEMBL1288187::methyl 3-(2-(naphthalen-2-yl)acetamido)thiophene-2-carboxylate
SMILES: COC(=O)c1sccc1NC(=O)Cc1ccc2ccccc2c1
InChI Key: InChIKey=CDKKUYMXRKJKHI-UHFFFAOYSA-N
Data: 3 IC50
Activity Spreadsheet -- Enzyme Inhibition Constant Data from BindingDB
Found 3 hits for monomerid = 50332047
Trg + Lig
Ki
nM
ΔG°
kcal/mole
IC50
nM
Kd
nM
EC50/IC50
nM
koff
s-1
kon
M-1s-1
pHTemp
°C
Mitogen-activated protein kinase 8
(Homo sapiens (Human))
BDBM50332047
(CHEMBL1288187 | methyl 3-(2-(naphthalen-2-yl)aceta...)
Show SMILES COC(=O)c1sccc1NC(=O)Cc1ccc2ccccc2c1
Show InChI InChI=1S/C18H15NO3S/c1-22-18(21)17-15(8-9-23-17)19-16(20)11-12-6-7-13-4-2-3-5-14(13)10-12/h2-10H,11H2,1H3,(H,19,20)
NCI pathway
Reactome pathway
n/an/a 600n/an/an/an/an/an/a
Elan Pharmaceuticals
Curated by ChEMBL
Assay Description
Inhibition of recombinant JNK1 after 60 mins by TR-FRET assay
Bioorg Med Chem Lett 20: 7303-7 (2010)
Article DOI: 10.1016/j.bmcl.2010.10.066
BindingDB Entry DOI: 10.7270/Q20865JW
Mitogen-activated protein kinase 10
(Homo sapiens (Human))
BDBM50332047
(CHEMBL1288187 | methyl 3-(2-(naphthalen-2-yl)aceta...)
Show SMILES COC(=O)c1sccc1NC(=O)Cc1ccc2ccccc2c1
Show InChI InChI=1S/C18H15NO3S/c1-22-18(21)17-15(8-9-23-17)19-16(20)11-12-6-7-13-4-2-3-5-14(13)10-12/h2-10H,11H2,1H3,(H,19,20)
NCI pathway
Reactome pathway
n/an/a 3.90E+3n/an/an/an/an/an/a
Elan Pharmaceuticals
Curated by ChEMBL
Assay Description
Inhibition of recombinant JNK3 after 60 mins by TR-FRET assay
Bioorg Med Chem Lett 20: 7303-7 (2010)
Article DOI: 10.1016/j.bmcl.2010.10.066
BindingDB Entry DOI: 10.7270/Q20865JW
Mitogen-activated protein kinase 9
(Homo sapiens (Human))
BDBM50332047
(CHEMBL1288187 | methyl 3-(2-(naphthalen-2-yl)aceta...)
Show SMILES COC(=O)c1sccc1NC(=O)Cc1ccc2ccccc2c1
Show InChI InChI=1S/C18H15NO3S/c1-22-18(21)17-15(8-9-23-17)19-16(20)11-12-6-7-13-4-2-3-5-14(13)10-12/h2-10H,11H2,1H3,(H,19,20)
NCI pathway
Reactome pathway
n/an/a>5.00E+4n/an/an/an/an/an/a
Elan Pharmaceuticals
Curated by ChEMBL
Assay Description
Inhibition of recombinant JNK2 after 60 mins by TR-FRET assay
Bioorg Med Chem Lett 20: 7303-7 (2010)
Article DOI: 10.1016/j.bmcl.2010.10.066
BindingDB Entry DOI: 10.7270/Q20865JW