BDBM50332051 CHEMBL1288216::methyl 3-(2-(quinolin-5-yl)acetamido)thiophene-2-carboxylate
SMILES: COC(=O)c1sccc1NC(=O)Cc1cccc2ncccc12
InChI Key: InChIKey=MWQGXLPPKAMINM-UHFFFAOYSA-N
Data: 3 IC50
Activity Spreadsheet -- Enzyme Inhibition Constant Data from BindingDB
Found 3 hits for monomerid = 50332051
Trg + Lig
Ki
nM
ΔG°
kcal/mole
IC50
nM
Kd
nM
EC50/IC50
nM
koff
s-1
kon
M-1s-1
pHTemp
°C
Mitogen-activated protein kinase 8
(Homo sapiens (Human))
BDBM50332051
(CHEMBL1288216 | methyl 3-(2-(quinolin-5-yl)acetami...)
Show SMILES COC(=O)c1sccc1NC(=O)Cc1cccc2ncccc12
Show InChI InChI=1S/C17H14N2O3S/c1-22-17(21)16-14(7-9-23-16)19-15(20)10-11-4-2-6-13-12(11)5-3-8-18-13/h2-9H,10H2,1H3,(H,19,20)
NCI pathway
Reactome pathway
n/an/a 300n/an/an/an/an/an/a
Elan Pharmaceuticals
Curated by ChEMBL
Assay Description
Inhibition of recombinant JNK1 after 60 mins by TR-FRET assay
Bioorg Med Chem Lett 20: 7303-7 (2010)
Article DOI: 10.1016/j.bmcl.2010.10.066
BindingDB Entry DOI: 10.7270/Q20865JW
Mitogen-activated protein kinase 10
(Homo sapiens (Human))
BDBM50332051
(CHEMBL1288216 | methyl 3-(2-(quinolin-5-yl)acetami...)
Show SMILES COC(=O)c1sccc1NC(=O)Cc1cccc2ncccc12
Show InChI InChI=1S/C17H14N2O3S/c1-22-17(21)16-14(7-9-23-16)19-15(20)10-11-4-2-6-13-12(11)5-3-8-18-13/h2-9H,10H2,1H3,(H,19,20)
NCI pathway
Reactome pathway
n/an/a 610n/an/an/an/an/an/a
Elan Pharmaceuticals
Curated by ChEMBL
Assay Description
Inhibition of recombinant JNK3 after 60 mins by TR-FRET assay
Bioorg Med Chem Lett 20: 7303-7 (2010)
Article DOI: 10.1016/j.bmcl.2010.10.066
BindingDB Entry DOI: 10.7270/Q20865JW
Mitogen-activated protein kinase 9
(Homo sapiens (Human))
BDBM50332051
(CHEMBL1288216 | methyl 3-(2-(quinolin-5-yl)acetami...)
Show SMILES COC(=O)c1sccc1NC(=O)Cc1cccc2ncccc12
Show InChI InChI=1S/C17H14N2O3S/c1-22-17(21)16-14(7-9-23-16)19-15(20)10-11-4-2-6-13-12(11)5-3-8-18-13/h2-9H,10H2,1H3,(H,19,20)
NCI pathway
Reactome pathway
n/an/a 3.00E+3n/an/an/an/an/an/a
Elan Pharmaceuticals
Curated by ChEMBL
Assay Description
Inhibition of recombinant JNK2 after 60 mins by TR-FRET assay
Bioorg Med Chem Lett 20: 7303-7 (2010)
Article DOI: 10.1016/j.bmcl.2010.10.066
BindingDB Entry DOI: 10.7270/Q20865JW