null
SMILES: COC(=O)c1cccnc1NC(=O)Cc1cccc2ccccc12
InChI Key: InChIKey=AXEYMKDXMBOZEO-UHFFFAOYSA-N
Activity Spreadsheet -- Enzyme Inhibition Constant Data from BindingDB
Found 3 hits for monomerid = 50332061
Trg + Lig
Ki
nM
ΔG°
kcal/mole
IC50
nM
Kd
nM
EC50/IC50
nM
koff
s-1
kon
M-1s-1
pHTemp
°C
Mitogen-activated protein kinase 8
(Homo sapiens (Human))
BDBM50332061
(CHEMBL1288298 | methyl 2-(2-(naphthalen-1-yl)aceta...)
Show SMILES COC(=O)c1cccnc1NC(=O)Cc1cccc2ccccc12
Show InChI InChI=1S/C19H16N2O3/c1-24-19(23)16-10-5-11-20-18(16)21-17(22)12-14-8-4-7-13-6-2-3-9-15(13)14/h2-11H,12H2,1H3,(H,20,21,22)
NCI pathway
Reactome pathway
n/an/a>5.00E+4n/an/an/an/an/an/a
Elan Pharmaceuticals
Curated by ChEMBL
Assay Description
Inhibition of recombinant JNK1 after 60 mins by TR-FRET assay
Bioorg Med Chem Lett 20: 7303-7 (2010)
Article DOI: 10.1016/j.bmcl.2010.10.066
BindingDB Entry DOI: 10.7270/Q20865JW
Mitogen-activated protein kinase 10
(Homo sapiens (Human))
BDBM50332061
(CHEMBL1288298 | methyl 2-(2-(naphthalen-1-yl)aceta...)
Show SMILES COC(=O)c1cccnc1NC(=O)Cc1cccc2ccccc12
Show InChI InChI=1S/C19H16N2O3/c1-24-19(23)16-10-5-11-20-18(16)21-17(22)12-14-8-4-7-13-6-2-3-9-15(13)14/h2-11H,12H2,1H3,(H,20,21,22)
NCI pathway
Reactome pathway
n/an/a>5.00E+4n/an/an/an/an/an/a
Elan Pharmaceuticals
Curated by ChEMBL
Assay Description
Inhibition of recombinant JNK3 after 60 mins by TR-FRET assay
Bioorg Med Chem Lett 20: 7303-7 (2010)
Article DOI: 10.1016/j.bmcl.2010.10.066
BindingDB Entry DOI: 10.7270/Q20865JW
Mitogen-activated protein kinase 9
(Homo sapiens (Human))
BDBM50332061
(CHEMBL1288298 | methyl 2-(2-(naphthalen-1-yl)aceta...)
Show SMILES COC(=O)c1cccnc1NC(=O)Cc1cccc2ccccc12
Show InChI InChI=1S/C19H16N2O3/c1-24-19(23)16-10-5-11-20-18(16)21-17(22)12-14-8-4-7-13-6-2-3-9-15(13)14/h2-11H,12H2,1H3,(H,20,21,22)
NCI pathway
Reactome pathway
n/an/a>5.00E+4n/an/an/an/an/an/a
Elan Pharmaceuticals
Curated by ChEMBL
Assay Description
Inhibition of recombinant JNK2 after 60 mins by TR-FRET assay
Bioorg Med Chem Lett 20: 7303-7 (2010)
Article DOI: 10.1016/j.bmcl.2010.10.066
BindingDB Entry DOI: 10.7270/Q20865JW