null
SMILES: COc1ccc(CC(=O)Nc2ccsc2-c2cn(C)cn2)cc1
InChI Key: InChIKey=RYGONSQYUUISGP-UHFFFAOYSA-N
Activity Spreadsheet -- Enzyme Inhibition Constant Data from BindingDB
Found 7 hits for monomerid = 50332081
Trg + Lig
Ki
nM
ΔG°
kcal/mole
IC50
nM
Kd
nM
EC50/IC50
nM
koff
s-1
kon
M-1s-1
pHTemp
°C
Mitogen-activated protein kinase 8
(Homo sapiens (Human))
BDBM50332081
(2-(4-methoxyphenyl)-N-(2-(1-methyl-1H-imidazol-4-y...)
Show SMILES COc1ccc(CC(=O)Nc2ccsc2-c2cn(C)cn2)cc1
Show InChI InChI=1S/C17H17N3O2S/c1-20-10-15(18-11-20)17-14(7-8-23-17)19-16(21)9-12-3-5-13(22-2)6-4-12/h3-8,10-11H,9H2,1-2H3,(H,19,21)
NCI pathway
Reactome pathway
n/an/a 2.39E+4n/an/an/an/an/an/a
Elan Pharmaceuticals
Curated by ChEMBL
Assay Description
Inhibition of recombinant JNK1 after 60 mins by TR-FRET assay
Bioorg Med Chem Lett 20: 7303-7 (2010)
Article DOI: 10.1016/j.bmcl.2010.10.066
BindingDB Entry DOI: 10.7270/Q20865JW
Mitogen-activated protein kinase 9
(Homo sapiens (Human))
BDBM50332081
(2-(4-methoxyphenyl)-N-(2-(1-methyl-1H-imidazol-4-y...)
Show SMILES COc1ccc(CC(=O)Nc2ccsc2-c2cn(C)cn2)cc1
Show InChI InChI=1S/C17H17N3O2S/c1-20-10-15(18-11-20)17-14(7-8-23-17)19-16(21)9-12-3-5-13(22-2)6-4-12/h3-8,10-11H,9H2,1-2H3,(H,19,21)
NCI pathway
Reactome pathway
n/an/a>5.00E+4n/an/an/an/an/an/a
Elan Pharmaceuticals
Curated by ChEMBL
Assay Description
Inhibition of recombinant JNK2 after 60 mins by TR-FRET assay
Bioorg Med Chem Lett 20: 7303-7 (2010)
Article DOI: 10.1016/j.bmcl.2010.10.066
BindingDB Entry DOI: 10.7270/Q20865JW
Mitogen-activated protein kinase 10
(Homo sapiens (Human))
BDBM50332081
(2-(4-methoxyphenyl)-N-(2-(1-methyl-1H-imidazol-4-y...)
Show SMILES COc1ccc(CC(=O)Nc2ccsc2-c2cn(C)cn2)cc1
Show InChI InChI=1S/C17H17N3O2S/c1-20-10-15(18-11-20)17-14(7-8-23-17)19-16(21)9-12-3-5-13(22-2)6-4-12/h3-8,10-11H,9H2,1-2H3,(H,19,21)
NCI pathway
Reactome pathway
n/an/a 3.10E+4n/an/an/an/an/an/a
Elan Pharmaceuticals
Curated by ChEMBL
Assay Description
Inhibition of recombinant JNK3 after 60 mins by TR-FRET assay
Bioorg Med Chem Lett 20: 7303-7 (2010)
Article DOI: 10.1016/j.bmcl.2010.10.066
BindingDB Entry DOI: 10.7270/Q20865JW
Mitogen-activated protein kinase 8
(Homo sapiens (Human))
BDBM50332081
(2-(4-methoxyphenyl)-N-(2-(1-methyl-1H-imidazol-4-y...)
Show SMILES COc1ccc(CC(=O)Nc2ccsc2-c2cn(C)cn2)cc1
Show InChI InChI=1S/C17H17N3O2S/c1-20-10-15(18-11-20)17-14(7-8-23-17)19-16(21)9-12-3-5-13(22-2)6-4-12/h3-8,10-11H,9H2,1-2H3,(H,19,21)
NCI pathway
Reactome pathway
US Patent
n/an/a>1.00E+4n/an/an/an/an/an/a
IMAGO PHARMACEUTICALS, INC.
US Patent
Assay Description
(1) Assay buffer #1 with 0.0025% Tween and 1 mM DTT was prepared using JNK buffer stock solution.(2) Assay buffer #2 with 0.025% BSA was prepared usi...
US Patent US9796706 (2017)
BindingDB Entry DOI: 10.7270/Q24T6MHK
Mitogen-activated protein kinase 14
(Homo sapiens (Human))
BDBM50332081
(2-(4-methoxyphenyl)-N-(2-(1-methyl-1H-imidazol-4-y...)
Show SMILES COc1ccc(CC(=O)Nc2ccsc2-c2cn(C)cn2)cc1
Show InChI InChI=1S/C17H17N3O2S/c1-20-10-15(18-11-20)17-14(7-8-23-17)19-16(21)9-12-3-5-13(22-2)6-4-12/h3-8,10-11H,9H2,1-2H3,(H,19,21)
NCI pathway
Reactome pathway
n/an/a>5.00E+4n/an/an/an/an/an/a
Elan Pharmaceuticals
Curated by ChEMBL
Assay Description
Inhibition of recombinant p38alpha after 60 mins by TR-FRET assay
Bioorg Med Chem Lett 20: 7303-7 (2010)
Article DOI: 10.1016/j.bmcl.2010.10.066
BindingDB Entry DOI: 10.7270/Q20865JW
Mitogen-activated protein kinase 10
(Homo sapiens (Human))
BDBM50332081
(2-(4-methoxyphenyl)-N-(2-(1-methyl-1H-imidazol-4-y...)
Show SMILES COc1ccc(CC(=O)Nc2ccsc2-c2cn(C)cn2)cc1
Show InChI InChI=1S/C17H17N3O2S/c1-20-10-15(18-11-20)17-14(7-8-23-17)19-16(21)9-12-3-5-13(22-2)6-4-12/h3-8,10-11H,9H2,1-2H3,(H,19,21)
NCI pathway
Reactome pathway
US Patent
n/an/a>1.00E+4n/an/an/an/an/an/a
IMAGO PHARMACEUTICALS, INC.
US Patent
Assay Description
(1) Assay buffer #1 with 0.0025% Tween and 1 mM DTT was prepared using JNK buffer stock solution.(2) Assay buffer #2 with 0.025% BSA was prepared usi...
US Patent US9796706 (2017)
BindingDB Entry DOI: 10.7270/Q24T6MHK
Mitogen-activated protein kinase 1
(Homo sapiens (Human))
BDBM50332081
(2-(4-methoxyphenyl)-N-(2-(1-methyl-1H-imidazol-4-y...)
Show SMILES COc1ccc(CC(=O)Nc2ccsc2-c2cn(C)cn2)cc1
Show InChI InChI=1S/C17H17N3O2S/c1-20-10-15(18-11-20)17-14(7-8-23-17)19-16(21)9-12-3-5-13(22-2)6-4-12/h3-8,10-11H,9H2,1-2H3,(H,19,21)
NCI pathway
Reactome pathway
n/an/a>5.00E+4n/an/an/an/an/an/a
Elan Pharmaceuticals
Curated by ChEMBL
Assay Description
Inhibition of recombinant Erk2 after 60 mins by TR-FRET assay
Bioorg Med Chem Lett 20: 7303-7 (2010)
Article DOI: 10.1016/j.bmcl.2010.10.066
BindingDB Entry DOI: 10.7270/Q20865JW