null
SMILES: OCc1sccc1NC(=O)Cc1ccccc1
InChI Key: InChIKey=RBTSJYWVZUKXCH-UHFFFAOYSA-N
Activity Spreadsheet -- Enzyme Inhibition Constant Data from BindingDB
Found 1 hit for monomerid = 50332094
Trg + Lig
Ki
nM
ΔG°
kcal/mole
IC50
nM
Kd
nM
EC50/IC50
nM
koff
s-1
kon
M-1s-1
pHTemp
°C
Mitogen-activated protein kinase 10
(Homo sapiens (Human))
BDBM50332094
(CHEMBL1288933 | N-(2-(hydroxymethyl)thiophen-3-yl)...)
Show SMILES OCc1sccc1NC(=O)Cc1ccccc1
Show InChI InChI=1S/C13H13NO2S/c15-9-12-11(6-7-17-12)14-13(16)8-10-4-2-1-3-5-10/h1-7,15H,8-9H2,(H,14,16)
NCI pathway
Reactome pathway
n/an/a>5.00E+4n/an/an/an/an/an/a
Elan Pharmaceuticals
Curated by ChEMBL
Assay Description
Inhibition of recombinant JNK3 after 60 mins by TR-FRET assay
Bioorg Med Chem Lett 20: 7303-7 (2010)
Article DOI: 10.1016/j.bmcl.2010.10.066
BindingDB Entry DOI: 10.7270/Q20865JW