BDBM50332119 1-(hydroxy[3-(trimethylammonio)propyl]amino)-1-oxododecan-2-aminium chloride::CHEMBL1287977
SMILES: CCCCCCCCCCC([NH3+])C(=O)N(O)CCC[N+](C)(C)C
InChI Key: InChIKey=UFALZKNOCFUELM-UHFFFAOYSA-O
Data: 1 KI  1 IC50
Activity Spreadsheet -- Enzyme Inhibition Constant Data from BindingDB
Found 2 hits for monomerid = 50332119
Trg + Lig
Ki
nM
ΔG°
kcal/mole
IC50
nM
Kd
nM
EC50/IC50
nM
koff
s-1
kon
M-1s-1
pHTemp
°C
Phospholipase C
(Bacillus cereus)
BDBM50332119
(1-(hydroxy[3-(trimethylammonio)propyl]amino)-1-oxo...)
Show SMILES CCCCCCCCCCC([NH3+])C(=O)N(O)CCC[N+](C)(C)C
Show InChI InChI=1S/C18H40N3O2/c1-5-6-7-8-9-10-11-12-14-17(19)18(22)20(23)15-13-16-21(2,3)4/h17,23H,5-16,19H2,1-4H3/q+1/p+1
2.60E+4n/an/an/an/an/an/an/an/a
Institute of Advance Chemistry of Catalonia (IQAC-CSIC)
Curated by ChEMBL
Assay Description
Mixed-type inhibition of Bacillus cereus phosphatidylcholine preferred phospholipase C by Dixon plot analysis
Bioorg Med Chem 18: 8549-55 (2010)
Article DOI: 10.1016/j.bmc.2010.10.031
BindingDB Entry DOI: 10.7270/Q2VH5P32
Phospholipase C
(Bacillus cereus)
BDBM50332119
(1-(hydroxy[3-(trimethylammonio)propyl]amino)-1-oxo...)
Show SMILES CCCCCCCCCCC([NH3+])C(=O)N(O)CCC[N+](C)(C)C
Show InChI InChI=1S/C18H40N3O2/c1-5-6-7-8-9-10-11-12-14-17(19)18(22)20(23)15-13-16-21(2,3)4/h17,23H,5-16,19H2,1-4H3/q+1/p+1
n/an/a 9.70E+4n/an/an/an/an/an/a
Institute of Advance Chemistry of Catalonia (IQAC-CSIC)
Curated by ChEMBL
Assay Description
Inhibition of Bacillus cereus phosphatidylcholine preferred phospholipase C after 100 seconds
Bioorg Med Chem 18: 8549-55 (2010)
Article DOI: 10.1016/j.bmc.2010.10.031
BindingDB Entry DOI: 10.7270/Q2VH5P32