BDBM50332481 (R)-2-((R)-3-amino-3-(4-((2-methylquinolin-4-yl)methoxy)phenyl)-2-oxopyrrolidin-1-yl)-N-hydroxy-3-methylbutanamide::CHEMBL1630098
SMILES: CC(C)[C@@H](N1CC[C@](N)(C1=O)c1ccc(OCc2cc(C)nc3ccccc23)cc1)C(=O)NO
InChI Key: InChIKey=VINTZLVANMVXOH-ZEQKJWHPSA-N
Data: 5 IC50
Activity Spreadsheet -- Enzyme Inhibition Constant Data from BindingDB
Found 5 hits for monomerid = 50332481
Trg + Lig
Ki
nM
ΔG°
kcal/mole
IC50
nM
Kd
nM
EC50/IC50
nM
koff
s-1
kon
M-1s-1
pHTemp
°C
Matrix metalloproteinase-9
(Homo sapiens (Human))
BDBM50332481
((R)-2-((R)-3-amino-3-(4-((2-methylquinolin-4-yl)me...)
Show SMILES CC(C)[C@@H](N1CC[C@](N)(C1=O)c1ccc(OCc2cc(C)nc3ccccc23)cc1)C(=O)NO |r|
Show InChI InChI=1S/C26H30N4O4/c1-16(2)23(24(31)29-33)30-13-12-26(27,25(30)32)19-8-10-20(11-9-19)34-15-18-14-17(3)28-22-7-5-4-6-21(18)22/h4-11,14,16,23,33H,12-13,15,27H2,1-3H3,(H,29,31)/t23-,26-/m1/s1
Reactome pathway
n/an/a 4.60E+5n/an/an/an/an/an/a
Yonsei University
Curated by ChEMBL
Assay Description
Inhibition of human MMP9 in cell-free system by fluorescent spectroscopy
Bioorg Med Chem 18: 8618-29 (2010)
Article DOI: 10.1016/j.bmc.2010.10.006
BindingDB Entry DOI: 10.7270/Q2NV9JHW
Disintegrin and metalloproteinase domain-containing protein 17
(Homo sapiens (Human))
BDBM50332481
((R)-2-((R)-3-amino-3-(4-((2-methylquinolin-4-yl)me...)
Show SMILES CC(C)[C@@H](N1CC[C@](N)(C1=O)c1ccc(OCc2cc(C)nc3ccccc23)cc1)C(=O)NO |r|
Show InChI InChI=1S/C26H30N4O4/c1-16(2)23(24(31)29-33)30-13-12-26(27,25(30)32)19-8-10-20(11-9-19)34-15-18-14-17(3)28-22-7-5-4-6-21(18)22/h4-11,14,16,23,33H,12-13,15,27H2,1-3H3,(H,29,31)/t23-,26-/m1/s1
Reactome pathway
n/an/a 0.100n/an/an/an/an/an/a
Yonsei University
Curated by ChEMBL
Assay Description
Inhibition of human TACE by fluorescent spectroscopy
Bioorg Med Chem 18: 8618-29 (2010)
Article DOI: 10.1016/j.bmc.2010.10.006
BindingDB Entry DOI: 10.7270/Q2NV9JHW
Disintegrin and metalloproteinase domain-containing protein 17
(Homo sapiens (Human))
BDBM50332481
((R)-2-((R)-3-amino-3-(4-((2-methylquinolin-4-yl)me...)
Show SMILES CC(C)[C@@H](N1CC[C@](N)(C1=O)c1ccc(OCc2cc(C)nc3ccccc23)cc1)C(=O)NO |r|
Show InChI InChI=1S/C26H30N4O4/c1-16(2)23(24(31)29-33)30-13-12-26(27,25(30)32)19-8-10-20(11-9-19)34-15-18-14-17(3)28-22-7-5-4-6-21(18)22/h4-11,14,16,23,33H,12-13,15,27H2,1-3H3,(H,29,31)/t23-,26-/m1/s1
Reactome pathway
n/an/a 12n/an/an/an/an/an/a
Yonsei University
Curated by ChEMBL
Assay Description
Inhibition of human TACE by fluorescent spectroscopy
Bioorg Med Chem 18: 8618-29 (2010)
Article DOI: 10.1016/j.bmc.2010.10.006
BindingDB Entry DOI: 10.7270/Q2NV9JHW
Stromelysin-1
(Homo sapiens (Human))
BDBM50332481
((R)-2-((R)-3-amino-3-(4-((2-methylquinolin-4-yl)me...)
Show SMILES CC(C)[C@@H](N1CC[C@](N)(C1=O)c1ccc(OCc2cc(C)nc3ccccc23)cc1)C(=O)NO |r|
Show InChI InChI=1S/C26H30N4O4/c1-16(2)23(24(31)29-33)30-13-12-26(27,25(30)32)19-8-10-20(11-9-19)34-15-18-14-17(3)28-22-7-5-4-6-21(18)22/h4-11,14,16,23,33H,12-13,15,27H2,1-3H3,(H,29,31)/t23-,26-/m1/s1
Reactome pathway
n/an/a 3.90E+3n/an/an/an/an/an/a
Yonsei University
Curated by ChEMBL
Assay Description
Inhibition of human MMP3 in cell-free system by fluorescent spectroscopy
Bioorg Med Chem 18: 8618-29 (2010)
Article DOI: 10.1016/j.bmc.2010.10.006
BindingDB Entry DOI: 10.7270/Q2NV9JHW
Interstitial collagenase
(Homo sapiens (Human))
BDBM50332481
((R)-2-((R)-3-amino-3-(4-((2-methylquinolin-4-yl)me...)
Show SMILES CC(C)[C@@H](N1CC[C@](N)(C1=O)c1ccc(OCc2cc(C)nc3ccccc23)cc1)C(=O)NO |r|
Show InChI InChI=1S/C26H30N4O4/c1-16(2)23(24(31)29-33)30-13-12-26(27,25(30)32)19-8-10-20(11-9-19)34-15-18-14-17(3)28-22-7-5-4-6-21(18)22/h4-11,14,16,23,33H,12-13,15,27H2,1-3H3,(H,29,31)/t23-,26-/m1/s1
Reactome pathway
n/an/a 4.93E+6n/an/an/an/an/an/a
Yonsei University
Curated by ChEMBL
Assay Description
Inhibition of human MMP1 in cell-free system by fluorescent spectroscopy
Bioorg Med Chem 18: 8618-29 (2010)
Article DOI: 10.1016/j.bmc.2010.10.006
BindingDB Entry DOI: 10.7270/Q2NV9JHW