null
SMILES: COc1ccc(Nc2nnc(o2)-c2ccc(cc2)S(C)(=O)=O)cc1
InChI Key: InChIKey=NLXIOMAECJKNSY-UHFFFAOYSA-N
Activity Spreadsheet -- Enzyme Inhibition Constant Data from BindingDB
Found 1 hit for monomerid = 50332522
Trg + Lig
Ki
nM
ΔG°
kcal/mole
IC50
nM
Kd
nM
EC50/IC50
nM
koff
s-1
kon
M-1s-1
pHTemp
°C
Glycogen synthase kinase-3 beta
(Homo sapiens (Human))
BDBM50332522
(CHEMBL1630486 | N-(4-Methoxyphenyl)-5-(4-(methylsu...)
Show SMILES COc1ccc(Nc2nnc(o2)-c2ccc(cc2)S(C)(=O)=O)cc1
Show InChI InChI=1S/C16H15N3O4S/c1-22-13-7-5-12(6-8-13)17-16-19-18-15(23-16)11-3-9-14(10-4-11)24(2,20)21/h3-10H,1-2H3,(H,17,19)
NCI pathway
Reactome pathway
n/an/a 314n/an/an/an/an/an/a
University of Louisiana at Monroe
Curated by ChEMBL
Assay Description
Inhibition of recombinant GSK3beta Z'-LYTE kinase assay kit method
J Med Chem 53: 8534-45 (2010)
Article DOI: 10.1021/jm100941j
BindingDB Entry DOI: 10.7270/Q2DB8230