BDBM50332538 CHEMBL1630452::N-(3-chloro-4-methylphenyl)-5-(4-nitrophenyl)-1,3,4-oxadiazol-2-amine
SMILES: Cc1ccc(Nc2nnc(o2)-c2ccc(cc2)[N+]([O-])=O)cc1Cl
InChI Key: InChIKey=JYCNWQGNEJYDQS-UHFFFAOYSA-N
Data: 1 IC50
Activity Spreadsheet -- Enzyme Inhibition Constant Data from BindingDB
Found 1 hit for monomerid = 50332538
Trg + Lig
Ki
nM
ΔG°
kcal/mole
IC50
nM
Kd
nM
EC50/IC50
nM
koff
s-1
kon
M-1s-1
pHTemp
°C
Glycogen synthase kinase-3 beta
(Homo sapiens (Human))
BDBM50332538
(CHEMBL1630452 | N-(3-chloro-4-methylphenyl)-5-(4-n...)
Show SMILES Cc1ccc(Nc2nnc(o2)-c2ccc(cc2)[N+]([O-])=O)cc1Cl
Show InChI InChI=1S/C15H11ClN4O3/c1-9-2-5-11(8-13(9)16)17-15-19-18-14(23-15)10-3-6-12(7-4-10)20(21)22/h2-8H,1H3,(H,17,19)
NCI pathway
Reactome pathway
n/an/a 17n/an/an/an/an/an/a
University of Louisiana at Monroe
Curated by ChEMBL
Assay Description
Inhibition of recombinant GSK3beta Z'-LYTE kinase assay kit method
J Med Chem 53: 8534-45 (2010)
Article DOI: 10.1021/jm100941j
BindingDB Entry DOI: 10.7270/Q2DB8230