BDBM50332782 CHEMBL368779::N'-hydroxy-4-methoxybenzimidamide::N-Hydroxy-4-methoxy-benzamidine
SMILES: COc1ccc(cc1)C(=N)NO
InChI Key: InChIKey=WVALRFKCJCIVBR-UHFFFAOYSA-N
Data: 1 IC50
Activity Spreadsheet -- Enzyme Inhibition Constant Data from BindingDB
Found 1 hit for monomerid = 50332782
Trg + Lig
Ki
nM
ΔG°
kcal/mole
IC50
nM
Kd
nM
EC50/IC50
nM
koff
s-1
kon
M-1s-1
pHTemp
°C
BiP isoform A
(Glycine max)
BDBM50332782
(CHEMBL368779 | N'-hydroxy-4-methoxybenzimidamide |...)
Show SMILES COc1ccc(cc1)C(=N)NO
Show InChI InChI=1S/C8H10N2O2/c1-12-7-4-2-6(3-5-7)8(9)10-11/h2-5,11H,1H3,(H2,9,10)
n/an/a 5.50E+4n/an/an/an/an/an/a
Democritus University of Thrace
Curated by ChEMBL
Assay Description
Inhibition of soybean lipoxygenase at by UV spectrophotometry
Eur J Med Chem 45: 5635-45 (2010)
Article DOI: 10.1016/j.ejmech.2010.09.016
BindingDB Entry DOI: 10.7270/Q2VD6ZQS