null
SMILES: C1CCC(C1)C#Cc1n[nH]c2ccccc12
InChI Key: InChIKey=RAGNROXQUZBSQB-UHFFFAOYSA-N
Activity Spreadsheet -- Enzyme Inhibition Constant Data from BindingDB
Found 4 hits for monomerid = 50333023
Trg + Lig
Ki
nM
ΔG°
kcal/mole
IC50
nM
Kd
nM
EC50/IC50
nM
koff
s-1
kon
M-1s-1
pHTemp
°C
Serine/threonine-protein kinase mTOR
(Homo sapiens (Human))
BDBM50333023
(3-(Cyclopentylethynyl)-1H-indazole | CHEMBL1631896)
Show SMILES C1CCC(C1)C#Cc1n[nH]c2ccccc12
Show InChI InChI=1S/C14H14N2/c1-2-6-11(5-1)9-10-14-12-7-3-4-8-13(12)15-16-14/h3-4,7-8,11H,1-2,5-6H2,(H,15,16)
NCI pathway
Reactome pathway
n/an/a>5.00E+4n/an/an/an/an/an/a
TBA
Curated by ChEMBL
Assay Description
Inhibition of mTORC1 expressed in HEK293 cells assessed as PRAS40 Ser183 phosphorylation level by LanthaScreen cellular assay
J Med Chem 53: 8368-8375 (2010)
Article DOI: 10.1021/jm100825h
BindingDB Entry DOI: 10.7270/Q2NP24PS
Phosphatidylinositol 4,5-bisphosphate 3-kinase catalytic subunit alpha isoform
(Homo sapiens (Human))
BDBM50333023
(3-(Cyclopentylethynyl)-1H-indazole | CHEMBL1631896)
Show SMILES C1CCC(C1)C#Cc1n[nH]c2ccccc12
Show InChI InChI=1S/C14H14N2/c1-2-6-11(5-1)9-10-14-12-7-3-4-8-13(12)15-16-14/h3-4,7-8,11H,1-2,5-6H2,(H,15,16)
NCI pathway
Reactome pathway
n/an/a>1.00E+5n/an/an/an/an/an/a
TBA
Curated by ChEMBL
Assay Description
Inhibition of PI3Kalpha by LanthaScreen Eu kinase binding assay
J Med Chem 53: 8368-8375 (2010)
Article DOI: 10.1021/jm100825h
BindingDB Entry DOI: 10.7270/Q2NP24PS
Serine/threonine-protein kinase mTOR
(Homo sapiens (Human))
BDBM50333023
(3-(Cyclopentylethynyl)-1H-indazole | CHEMBL1631896)
Show SMILES C1CCC(C1)C#Cc1n[nH]c2ccccc12
Show InChI InChI=1S/C14H14N2/c1-2-6-11(5-1)9-10-14-12-7-3-4-8-13(12)15-16-14/h3-4,7-8,11H,1-2,5-6H2,(H,15,16)
NCI pathway
Reactome pathway
n/an/a>1.00E+5n/an/an/an/an/an/a
TBA
Curated by ChEMBL
Assay Description
Inhibition of mTOR by LanthaScreen Eu kinase binding assay
J Med Chem 53: 8368-8375 (2010)
Article DOI: 10.1021/jm100825h
BindingDB Entry DOI: 10.7270/Q2NP24PS
[Pyruvate dehydrogenase (acetyl-transferring)] kinase isozyme 1, mitochondrial
(Homo sapiens (Human))
BDBM50333023
(3-(Cyclopentylethynyl)-1H-indazole | CHEMBL1631896)
Show SMILES C1CCC(C1)C#Cc1n[nH]c2ccccc12
Show InChI InChI=1S/C14H14N2/c1-2-6-11(5-1)9-10-14-12-7-3-4-8-13(12)15-16-14/h3-4,7-8,11H,1-2,5-6H2,(H,15,16)
n/an/a>1.00E+5n/an/an/an/an/an/a
TBA
Curated by ChEMBL
Assay Description
Inhibition of PDK1 by Z'-LYTE kinase activity assay
J Med Chem 53: 8368-8375 (2010)
Article DOI: 10.1021/jm100825h
BindingDB Entry DOI: 10.7270/Q2NP24PS