BDBM50333138 2-((4-methoxyphenoxy)methyl)-7-methyl-5H-[1,3,4]thiadiazolo[3,2-a]pyrimidin-5-one::CHEMBL1644702
SMILES: COc1ccc(OCc2nn3c(nc(C)cc3=O)s2)cc1
InChI Key: InChIKey=OOEDMOKWFYRVSN-UHFFFAOYSA-N
Data: 2 IC50
Activity Spreadsheet -- Enzyme Inhibition Constant Data from BindingDB
Found 2 hits for monomerid = 50333138
Trg + Lig
Ki
nM
ΔG°
kcal/mole
IC50
nM
Kd
nM
EC50/IC50
nM
koff
s-1
kon
M-1s-1
pHTemp
°C
Xanthine dehydrogenase/oxidase
(Rattus norvegicus)
BDBM50333138
(2-((4-methoxyphenoxy)methyl)-7-methyl-5H-[1,3,4]th...)
Show SMILES COc1ccc(OCc2nn3c(nc(C)cc3=O)s2)cc1
Show InChI InChI=1S/C14H13N3O3S/c1-9-7-13(18)17-14(15-9)21-12(16-17)8-20-11-5-3-10(19-2)4-6-11/h3-7H,8H2,1-2H3
n/an/a 289n/an/an/an/an/an/a
University of Mysore
Curated by ChEMBL
Assay Description
Inhibition of rat liver xanthine oxidase by spectrophotometry
Bioorg Med Chem 19: 211-20 (2011)
Article DOI: 10.1016/j.bmc.2010.11.034
BindingDB Entry DOI: 10.7270/Q26H4HPB
Xanthine dehydrogenase
(Bos taurus (Bovine))
BDBM50333138
(2-((4-methoxyphenoxy)methyl)-7-methyl-5H-[1,3,4]th...)
Show SMILES COc1ccc(OCc2nn3c(nc(C)cc3=O)s2)cc1
Show InChI InChI=1S/C14H13N3O3S/c1-9-7-13(18)17-14(15-9)21-12(16-17)8-20-11-5-3-10(19-2)4-6-11/h3-7H,8H2,1-2H3
n/an/a 269n/an/an/an/an/an/a
University of Mysore
Curated by ChEMBL
Assay Description
Inhibition of bovine milk xanthine oxidase by spectrophotometry
Bioorg Med Chem 19: 211-20 (2011)
Article DOI: 10.1016/j.bmc.2010.11.034
BindingDB Entry DOI: 10.7270/Q26H4HPB