BDBM50333141 7-methyl-2-(o-tolyloxymethyl)-5H-[1,3,4]thiadiazolo[3,2-a]pyrimidin-5-one::CHEMBL1644704
SMILES: Cc1cc(=O)n2nc(COc3ccccc3C)sc2n1
InChI Key: InChIKey=SYGYNZKBQXEZHX-UHFFFAOYSA-N
Data: 2 IC50
Activity Spreadsheet -- Enzyme Inhibition Constant Data from BindingDB
Found 2 hits for monomerid = 50333141
Trg + Lig
Ki
nM
ΔG°
kcal/mole
IC50
nM
Kd
nM
EC50/IC50
nM
koff
s-1
kon
M-1s-1
pHTemp
°C
Xanthine dehydrogenase/oxidase
(Rattus norvegicus)
BDBM50333141
(7-methyl-2-(o-tolyloxymethyl)-5H-[1,3,4]thiadiazol...)
Show SMILES Cc1cc(=O)n2nc(COc3ccccc3C)sc2n1
Show InChI InChI=1S/C14H13N3O2S/c1-9-5-3-4-6-11(9)19-8-12-16-17-13(18)7-10(2)15-14(17)20-12/h3-7H,8H2,1-2H3
n/an/a 362n/an/an/an/an/an/a
University of Mysore
Curated by ChEMBL
Assay Description
Inhibition of rat liver xanthine oxidase by spectrophotometry
Bioorg Med Chem 19: 211-20 (2011)
Article DOI: 10.1016/j.bmc.2010.11.034
BindingDB Entry DOI: 10.7270/Q26H4HPB
Xanthine dehydrogenase
(Bos taurus (Bovine))
BDBM50333141
(7-methyl-2-(o-tolyloxymethyl)-5H-[1,3,4]thiadiazol...)
Show SMILES Cc1cc(=O)n2nc(COc3ccccc3C)sc2n1
Show InChI InChI=1S/C14H13N3O2S/c1-9-5-3-4-6-11(9)19-8-12-16-17-13(18)7-10(2)15-14(17)20-12/h3-7H,8H2,1-2H3
n/an/a 326n/an/an/an/an/an/a
University of Mysore
Curated by ChEMBL
Assay Description
Inhibition of bovine milk xanthine oxidase by spectrophotometry
Bioorg Med Chem 19: 211-20 (2011)
Article DOI: 10.1016/j.bmc.2010.11.034
BindingDB Entry DOI: 10.7270/Q26H4HPB