BDBM50333152 5-Amino-2-(dimethylamino)-4-phenyl-6,7,8,9-tetrahydrobenzo[1,8-b]-naphthyridine-3-carbonitrile::CHEMBL1644725
SMILES: CN(C)c1nc2nc3CCCCc3c(N)c2c(-c2ccccc2)c1C#N
InChI Key: InChIKey=LKCYVFMFRAVOAD-UHFFFAOYSA-N
Data: 3 IC50
Activity Spreadsheet -- Enzyme Inhibition Constant Data from BindingDB
Found 3 hits for monomerid = 50333152
Trg + Lig
Ki
nM
ΔG°
kcal/mole
IC50
nM
Kd
nM
EC50/IC50
nM
koff
s-1
kon
M-1s-1
pHTemp
°C
Acetylcholinesterase
(Electrophorus electricus (Electric eel))
BDBM50333152
(5-Amino-2-(dimethylamino)-4-phenyl-6,7,8,9-tetrahy...)
Show SMILES CN(C)c1nc2nc3CCCCc3c(N)c2c(-c2ccccc2)c1C#N
Show InChI InChI=1S/C21H21N5/c1-26(2)21-15(12-22)17(13-8-4-3-5-9-13)18-19(23)14-10-6-7-11-16(14)24-20(18)25-21/h3-5,8-9H,6-7,10-11H2,1-2H3,(H2,23,24,25)
n/an/a 90n/an/an/an/an/an/a
Laboratorio de Radicales Libres y Qu�mica Computacional (IQOG, CSIC)
Curated by ChEMBL
Assay Description
Inhibition of Electrophorus electricus AChE by Ellman's method
Bioorg Med Chem 19: 122-33 (2011)
Article DOI: 10.1016/j.bmc.2010.11.040
BindingDB Entry DOI: 10.7270/Q22R3RX5
Butyrylcholinesterase (BuChE)
(Equus caballus (Horse))
BDBM50333152
(5-Amino-2-(dimethylamino)-4-phenyl-6,7,8,9-tetrahy...)
Show SMILES CN(C)c1nc2nc3CCCCc3c(N)c2c(-c2ccccc2)c1C#N
Show InChI InChI=1S/C21H21N5/c1-26(2)21-15(12-22)17(13-8-4-3-5-9-13)18-19(23)14-10-6-7-11-16(14)24-20(18)25-21/h3-5,8-9H,6-7,10-11H2,1-2H3,(H2,23,24,25)
n/an/a 7.50E+3n/an/an/an/an/an/a
Laboratorio de Radicales Libres y Qu�mica Computacional (IQOG, CSIC)
Curated by ChEMBL
Assay Description
Inhibition of horse serum BuChE by Ellman's method
Bioorg Med Chem 19: 122-33 (2011)
Article DOI: 10.1016/j.bmc.2010.11.040
BindingDB Entry DOI: 10.7270/Q22R3RX5
Acetylcholinesterase
(Bos taurus (bovine))
BDBM50333152
(5-Amino-2-(dimethylamino)-4-phenyl-6,7,8,9-tetrahy...)
Show SMILES CN(C)c1nc2nc3CCCCc3c(N)c2c(-c2ccccc2)c1C#N
Show InChI InChI=1S/C21H21N5/c1-26(2)21-15(12-22)17(13-8-4-3-5-9-13)18-19(23)14-10-6-7-11-16(14)24-20(18)25-21/h3-5,8-9H,6-7,10-11H2,1-2H3,(H2,23,24,25)
Reactome pathway
n/an/a 4.40E+3n/an/an/an/an/an/a
Laboratorio de Radicales Libres y Qu�mica Computacional (IQOG, CSIC)
Curated by ChEMBL
Assay Description
Inhibition of bovine erythrocytes AChE by Ellman's method
Bioorg Med Chem 19: 122-33 (2011)
Article DOI: 10.1016/j.bmc.2010.11.040
BindingDB Entry DOI: 10.7270/Q22R3RX5