BDBM50333153 5-Amino-2-(methyloxy)-6,7,8,9-tetrahydrobenzo[1,8-b]-naphthyridine-3-carbonitrile::CHEMBL1644726
SMILES: COc1nc2nc3CCCCc3c(N)c2cc1C#N
InChI Key: InChIKey=PQCQFSDRRXOQKV-UHFFFAOYSA-N
Data: 3 IC50
Activity Spreadsheet -- Enzyme Inhibition Constant Data from BindingDB
Found 3 hits for monomerid = 50333153
Trg + Lig
Ki
nM
ΔG°
kcal/mole
IC50
nM
Kd
nM
EC50/IC50
nM
koff
s-1
kon
M-1s-1
pHTemp
°C
Acetylcholinesterase
(Electrophorus electricus (Electric eel))
BDBM50333153
(5-Amino-2-(methyloxy)-6,7,8,9-tetrahydrobenzo[1,8-...)
Show SMILES COc1nc2nc3CCCCc3c(N)c2cc1C#N
Show InChI InChI=1S/C14H14N4O/c1-19-14-8(7-15)6-10-12(16)9-4-2-3-5-11(9)17-13(10)18-14/h6H,2-5H2,1H3,(H2,16,17,18)
n/an/a 60n/an/an/an/an/an/a
Laboratorio de Radicales Libres y Qu�mica Computacional (IQOG, CSIC)
Curated by ChEMBL
Assay Description
Inhibition of Electrophorus electricus AChE by Ellman's method
Bioorg Med Chem 19: 122-33 (2011)
Article DOI: 10.1016/j.bmc.2010.11.040
BindingDB Entry DOI: 10.7270/Q22R3RX5
Butyrylcholinesterase (BuChE)
(Equus caballus (Horse))
BDBM50333153
(5-Amino-2-(methyloxy)-6,7,8,9-tetrahydrobenzo[1,8-...)
Show SMILES COc1nc2nc3CCCCc3c(N)c2cc1C#N
Show InChI InChI=1S/C14H14N4O/c1-19-14-8(7-15)6-10-12(16)9-4-2-3-5-11(9)17-13(10)18-14/h6H,2-5H2,1H3,(H2,16,17,18)
n/an/a 9.60E+3n/an/an/an/an/an/a
Laboratorio de Radicales Libres y Qu�mica Computacional (IQOG, CSIC)
Curated by ChEMBL
Assay Description
Inhibition of horse serum BuChE by Ellman's method
Bioorg Med Chem 19: 122-33 (2011)
Article DOI: 10.1016/j.bmc.2010.11.040
BindingDB Entry DOI: 10.7270/Q22R3RX5
Acetylcholinesterase
(Bos taurus (bovine))
BDBM50333153
(5-Amino-2-(methyloxy)-6,7,8,9-tetrahydrobenzo[1,8-...)
Show SMILES COc1nc2nc3CCCCc3c(N)c2cc1C#N
Show InChI InChI=1S/C14H14N4O/c1-19-14-8(7-15)6-10-12(16)9-4-2-3-5-11(9)17-13(10)18-14/h6H,2-5H2,1H3,(H2,16,17,18)
Reactome pathway
n/an/a 1.60E+3n/an/an/an/an/an/a
Laboratorio de Radicales Libres y Qu�mica Computacional (IQOG, CSIC)
Curated by ChEMBL
Assay Description
Inhibition of bovine erythrocytes AChE by Ellman's method
Bioorg Med Chem 19: 122-33 (2011)
Article DOI: 10.1016/j.bmc.2010.11.040
BindingDB Entry DOI: 10.7270/Q22R3RX5