BDBM50333267 CHEMBL1645125::N1-(4-chloro-3-fluorophenyl)-N2-((1-methylpiperidin-4-yl)methyl)oxalamide
SMILES: CN1CCC(CNC(=O)C(=O)Nc2ccc(Cl)c(F)c2)CC1
InChI Key: InChIKey=YPIQYVOKJYHFPR-UHFFFAOYSA-N
Data: 1 IC50  1 Kd
Activity Spreadsheet -- Enzyme Inhibition Constant Data from BindingDB
Found 2 hits for monomerid = 50333267
Trg + Lig
Ki
nM
ΔG°
kcal/mole
IC50
nM
Kd
nM
EC50/IC50
nM
koff
s-1
kon
M-1s-1
pHTemp
°C
Envelope glycoprotein gp160
(Human immunodeficiency virus type 1 group M subtyp...)
BDBM50333267
(CHEMBL1645125 | N1-(4-chloro-3-fluorophenyl)-N2-((...)
Show SMILES CN1CCC(CNC(=O)C(=O)Nc2ccc(Cl)c(F)c2)CC1
Show InChI InChI=1S/C15H19ClFN3O2/c1-20-6-4-10(5-7-20)9-18-14(21)15(22)19-11-2-3-12(16)13(17)8-11/h2-3,8,10H,4-7,9H2,1H3,(H,18,21)(H,19,22)
n/an/an/a 4.30E+3n/an/an/an/an/a
Bryn Mawr College
Curated by ChEMBL
Assay Description
Binding affinity to HIV1 YU2 gp120 by isothermal titration calorimetry assay
Bioorg Med Chem 19: 91-101 (2011)
Article DOI: 10.1016/j.bmc.2010.11.049
BindingDB Entry DOI: 10.7270/Q25H7GHH
Envelope glycoprotein gp160
(Human immunodeficiency virus type 1 group M subtyp...)
BDBM50333267
(CHEMBL1645125 | N1-(4-chloro-3-fluorophenyl)-N2-((...)
Show SMILES CN1CCC(CNC(=O)C(=O)Nc2ccc(Cl)c(F)c2)CC1
Show InChI InChI=1S/C15H19ClFN3O2/c1-20-6-4-10(5-7-20)9-18-14(21)15(22)19-11-2-3-12(16)13(17)8-11/h2-3,8,10H,4-7,9H2,1H3,(H,18,21)(H,19,22)
n/an/a>1.00E+5n/an/an/an/an/an/a
Bryn Mawr College
Curated by ChEMBL
Assay Description
Inhibition of HIV1 YU2 gp120 binding to CD4 expressing Cf2Th-CD4/CCR5 cells assessed as inhibition of viral infection after 48 hrs
Bioorg Med Chem 19: 91-101 (2011)
Article DOI: 10.1016/j.bmc.2010.11.049
BindingDB Entry DOI: 10.7270/Q25H7GHH