BDBM50333273 CHEMBL1645119::N1-(4-chloro-3-fluorophenyl)-N2-(1-methylpiperidin-4-yl)oxalamide
SMILES: CN1CCC(CC1)NC(=O)C(=O)Nc1ccc(Cl)c(F)c1
InChI Key: InChIKey=SSJFLLNTEFSBLB-UHFFFAOYSA-N
Data: 1 IC50  1 Kd
Activity Spreadsheet -- Enzyme Inhibition Constant Data from BindingDB
Found 2 hits for monomerid = 50333273
Trg + Lig
Ki
nM
ΔG°
kcal/mole
IC50
nM
Kd
nM
EC50/IC50
nM
koff
s-1
kon
M-1s-1
pHTemp
°C
Envelope glycoprotein gp160
(Human immunodeficiency virus type 1 group M subtyp...)
BDBM50333273
(CHEMBL1645119 | N1-(4-chloro-3-fluorophenyl)-N2-(1...)
Show SMILES CN1CCC(CC1)NC(=O)C(=O)Nc1ccc(Cl)c(F)c1
Show InChI InChI=1S/C14H17ClFN3O2/c1-19-6-4-9(5-7-19)17-13(20)14(21)18-10-2-3-11(15)12(16)8-10/h2-3,8-9H,4-7H2,1H3,(H,17,20)(H,18,21)
n/an/an/a 9.40E+3n/an/an/an/an/a
Bryn Mawr College
Curated by ChEMBL
Assay Description
Binding affinity to HIV1 YU2 gp120 by isothermal titration calorimetry assay
Bioorg Med Chem 19: 91-101 (2011)
Article DOI: 10.1016/j.bmc.2010.11.049
BindingDB Entry DOI: 10.7270/Q25H7GHH
Envelope glycoprotein gp160
(Human immunodeficiency virus type 1 group M subtyp...)
BDBM50333273
(CHEMBL1645119 | N1-(4-chloro-3-fluorophenyl)-N2-(1...)
Show SMILES CN1CCC(CC1)NC(=O)C(=O)Nc1ccc(Cl)c(F)c1
Show InChI InChI=1S/C14H17ClFN3O2/c1-19-6-4-9(5-7-19)17-13(20)14(21)18-10-2-3-11(15)12(16)8-10/h2-3,8-9H,4-7H2,1H3,(H,17,20)(H,18,21)
n/an/a>1.00E+5n/an/an/an/an/an/a
Bryn Mawr College
Curated by ChEMBL
Assay Description
Inhibition of HIV1 YU2 gp120 binding to CD4 expressing Cf2Th-CD4/CCR5 cells assessed as inhibition of viral infection after 48 hrs
Bioorg Med Chem 19: 91-101 (2011)
Article DOI: 10.1016/j.bmc.2010.11.049
BindingDB Entry DOI: 10.7270/Q25H7GHH