BDBM50333918 (S)-2-(2-(benzofuran-6-carbonyl)-5,7-dichloro-1,2,3,4-tetrahydroisoquinoline-6-carboxamido)-3-(2-(methylsulfonyl)-1H-imidazol-5-yl)propanoic acid::CHEMBL1641627
SMILES: CS(=O)(=O)c1ncc(C[C@H](NC(=O)c2c(Cl)cc3CN(CCc3c2Cl)C(=O)c2ccc3ccoc3c2)C(O)=O)[nH]1
InChI Key: InChIKey=YGQRAJLJNWTQJX-IBGZPJMESA-N
Data: 2 IC50
Activity Spreadsheet -- Enzyme Inhibition Constant Data from BindingDB
Found 2 hits for monomerid = 50333918
Trg + Lig
Ki
nM
ΔG°
kcal/mole
IC50
nM
Kd
nM
EC50/IC50
nM
koff
s-1
kon
M-1s-1
pHTemp
°C
Integrin alpha-L/beta-2
(Homo sapiens (Human))
BDBM50333918
((S)-2-(2-(benzofuran-6-carbonyl)-5,7-dichloro-1,2,...)
Show SMILES CS(=O)(=O)c1ncc(C[C@H](NC(=O)c2c(Cl)cc3CN(CCc3c2Cl)C(=O)c2ccc3ccoc3c2)C(O)=O)[nH]1 |r|
Show InChI InChI=1S/C26H22Cl2N4O7S/c1-40(37,38)26-29-11-16(30-26)10-19(25(35)36)31-23(33)21-18(27)8-15-12-32(6-4-17(15)22(21)28)24(34)14-3-2-13-5-7-39-20(13)9-14/h2-3,5,7-9,11,19H,4,6,10,12H2,1H3,(H,29,30)(H,31,33)(H,35,36)/t19-/m0/s1
n/an/a 30n/an/an/an/an/an/a
Sunesis Pharmaceuticals, Inc
Curated by ChEMBL
Assay Description
Inhibition of LFA1/ICAM1 interaction in human Hut-78 cells
Bioorg Med Chem Lett 21: 307-10 (2010)
Article DOI: 10.1016/j.bmcl.2010.11.014
BindingDB Entry DOI: 10.7270/Q2WW7HXM
Integrin alpha-L/beta-2
(Homo sapiens (Human))
BDBM50333918
((S)-2-(2-(benzofuran-6-carbonyl)-5,7-dichloro-1,2,...)
Show SMILES CS(=O)(=O)c1ncc(C[C@H](NC(=O)c2c(Cl)cc3CN(CCc3c2Cl)C(=O)c2ccc3ccoc3c2)C(O)=O)[nH]1 |r|
Show InChI InChI=1S/C26H22Cl2N4O7S/c1-40(37,38)26-29-11-16(30-26)10-19(25(35)36)31-23(33)21-18(27)8-15-12-32(6-4-17(15)22(21)28)24(34)14-3-2-13-5-7-39-20(13)9-14/h2-3,5,7-9,11,19H,4,6,10,12H2,1H3,(H,29,30)(H,31,33)(H,35,36)/t19-/m0/s1
n/an/a 560n/an/an/an/an/an/a
Sunesis Pharmaceuticals, Inc
Curated by ChEMBL
Assay Description
Inhibition of LFA1/ICAM1 interaction in human Hut-78 cells in presence of 10% human serum
Bioorg Med Chem Lett 21: 307-10 (2010)
Article DOI: 10.1016/j.bmcl.2010.11.014
BindingDB Entry DOI: 10.7270/Q2WW7HXM