BDBM50333950 (S)-2-{(S)-2-Hydroxy-2-[(S)-18-(methanesulfonyl-methyl-amino)-4-(2-methoxy-ethoxy)-2,15-dioxo-11-oxa-3,14-diaza-tricyclo[14.3.1.1*5,9*]henicosa-1(20),5,7,9(21),16,18-hexaen-13-yl]-ethyl}-N-isobutyl-3-methyl-butyramide::CHEMBL1644468
SMILES: COCCOC1NC(=O)c2cc(cc(c2)C(=O)N[C@@H](COCc2cccc1c2)[C@@H](O)C[C@@H](C(C)C)C(=O)NCC(C)C)N(C)S(C)(=O)=O
InChI Key: InChIKey=PVPCBXKRPVESEX-LMDNDRLDSA-N
Data: 2 KI  1 IC50
Activity Spreadsheet -- Enzyme Inhibition Constant Data from BindingDB
Found 3 hits for monomerid = 50333950
Trg + Lig
Ki
nM
ΔG°
kcal/mole
IC50
nM
Kd
nM
EC50/IC50
nM
koff
s-1
kon
M-1s-1
pHTemp
°C
Renin
(Homo sapiens (Human))
BDBM50333950
((S)-2-{(S)-2-Hydroxy-2-[(S)-18-(methanesulfonyl-me...)
Show SMILES COCCOC1NC(=O)c2cc(cc(c2)C(=O)N[C@@H](COCc2cccc1c2)[C@@H](O)C[C@@H](C(C)C)C(=O)NCC(C)C)N(C)S(C)(=O)=O |r|
Show InChI InChI=1S/C34H50N4O9S/c1-21(2)18-35-33(42)28(22(3)4)17-30(39)29-20-46-19-23-9-8-10-24(13-23)34(47-12-11-45-6)37-32(41)26-14-25(31(40)36-29)15-27(16-26)38(5)48(7,43)44/h8-10,13-16,21-22,28-30,34,39H,11-12,17-20H2,1-7H3,(H,35,42)(H,36,40)(H,37,41)/t28-,29-,30-,34?/m0/s1
Reactome pathway
>5.00E+3n/an/an/an/an/an/an/an/a
Medivir AB
Curated by ChEMBL
Assay Description
Inhibition of renin
Bioorg Med Chem Lett 21: 358-62 (2010)
Article DOI: 10.1016/j.bmcl.2010.10.140
BindingDB Entry DOI: 10.7270/Q2HM58RJ
Cathepsin D
(Homo sapiens (Human))
BDBM50333950
((S)-2-{(S)-2-Hydroxy-2-[(S)-18-(methanesulfonyl-me...)
Show SMILES COCCOC1NC(=O)c2cc(cc(c2)C(=O)N[C@@H](COCc2cccc1c2)[C@@H](O)C[C@@H](C(C)C)C(=O)NCC(C)C)N(C)S(C)(=O)=O |r|
Show InChI InChI=1S/C34H50N4O9S/c1-21(2)18-35-33(42)28(22(3)4)17-30(39)29-20-46-19-23-9-8-10-24(13-23)34(47-12-11-45-6)37-32(41)26-14-25(31(40)36-29)15-27(16-26)38(5)48(7,43)44/h8-10,13-16,21-22,28-30,34,39H,11-12,17-20H2,1-7H3,(H,35,42)(H,36,40)(H,37,41)/t28-,29-,30-,34?/m0/s1
NCI pathway
Reactome pathway
>5.00E+3n/an/an/an/an/an/an/an/a
Medivir AB
Curated by ChEMBL
Assay Description
Inhibition of cathepsin D
Bioorg Med Chem Lett 21: 358-62 (2010)
Article DOI: 10.1016/j.bmcl.2010.10.140
BindingDB Entry DOI: 10.7270/Q2HM58RJ
Beta-secretase 1
(Homo sapiens (Human))
BDBM50333950
((S)-2-{(S)-2-Hydroxy-2-[(S)-18-(methanesulfonyl-me...)
Show SMILES COCCOC1NC(=O)c2cc(cc(c2)C(=O)N[C@@H](COCc2cccc1c2)[C@@H](O)C[C@@H](C(C)C)C(=O)NCC(C)C)N(C)S(C)(=O)=O |r|
Show InChI InChI=1S/C34H50N4O9S/c1-21(2)18-35-33(42)28(22(3)4)17-30(39)29-20-46-19-23-9-8-10-24(13-23)34(47-12-11-45-6)37-32(41)26-14-25(31(40)36-29)15-27(16-26)38(5)48(7,43)44/h8-10,13-16,21-22,28-30,34,39H,11-12,17-20H2,1-7H3,(H,35,42)(H,36,40)(H,37,41)/t28-,29-,30-,34?/m0/s1
n/an/a>1.00E+4n/an/an/an/an/an/a
Medivir AB
Curated by ChEMBL
Assay Description
Inhibition of BACE1
Bioorg Med Chem Lett 21: 358-62 (2010)
Article DOI: 10.1016/j.bmcl.2010.10.140
BindingDB Entry DOI: 10.7270/Q2HM58RJ