BDBM50334026 1-(3-(4-(3-chlorophenyl)-1H-imidazol-2-yl)benzyl)-4-fluoropiperidine::CHEMBL1644689
SMILES: FC1CCN(Cc2cccc(c2)-c2nc(c[nH]2)-c2cccc(Cl)c2)CC1
InChI Key: InChIKey=MTCIULBIXFOUOR-UHFFFAOYSA-N
Data: 2 EC50
Activity Spreadsheet -- Enzyme Inhibition Constant Data from BindingDB
Found 2 hits for monomerid = 50334026
Trg + Lig
Ki
nM
ΔG°
kcal/mole
IC50
nM
Kd
nM
EC50/IC50
nM
koff
s-1
kon
M-1s-1
pHTemp
°C
Cannabinoid receptor 2
(Homo sapiens (Human))
BDBM50334026
(1-(3-(4-(3-chlorophenyl)-1H-imidazol-2-yl)benzyl)-...)
Show SMILES FC1CCN(Cc2cccc(c2)-c2nc(c[nH]2)-c2cccc(Cl)c2)CC1
Show InChI InChI=1S/C21H21ClFN3/c22-18-6-2-4-16(12-18)20-13-24-21(25-20)17-5-1-3-15(11-17)14-26-9-7-19(23)8-10-26/h1-6,11-13,19H,7-10,14H2,(H,24,25)
Reactome pathway
n/an/an/an/a 8n/an/an/an/a
Merck Research Laboratory
Curated by ChEMBL
Assay Description
Agonist activity at human cloned CB2 receptor expressed in CHO cells assessed as inhibition of forskolin-induced cAMP accumulation
Bioorg Med Chem Lett 21: 182-5 (2010)
Article DOI: 10.1016/j.bmcl.2010.11.044
BindingDB Entry DOI: 10.7270/Q20P108G
Cannabinoid receptor 1
(Homo sapiens (Human))
BDBM50334026
(1-(3-(4-(3-chlorophenyl)-1H-imidazol-2-yl)benzyl)-...)
Show SMILES FC1CCN(Cc2cccc(c2)-c2nc(c[nH]2)-c2cccc(Cl)c2)CC1
Show InChI InChI=1S/C21H21ClFN3/c22-18-6-2-4-16(12-18)20-13-24-21(25-20)17-5-1-3-15(11-17)14-26-9-7-19(23)8-10-26/h1-6,11-13,19H,7-10,14H2,(H,24,25)
NCI pathway
Reactome pathway
n/an/an/an/a 130n/an/an/an/a
Merck Research Laboratory
Curated by ChEMBL
Assay Description
Agonist activity at human cloned CB1 receptor expressed in CHO cells assessed as inhibition of forskolin-induced cAMP accumulation
Bioorg Med Chem Lett 21: 182-5 (2010)
Article DOI: 10.1016/j.bmcl.2010.11.044
BindingDB Entry DOI: 10.7270/Q20P108G