BDBM50334027 1-(3-(4-(2,3-dichlorophenyl)-1H-imidazol-2-yl)benzyl)-4-methylpiperidine::CHEMBL1644690
SMILES: CC1CCN(Cc2cccc(c2)-c2nc(c[nH]2)-c2cccc(Cl)c2Cl)CC1
InChI Key: InChIKey=XIGHDEUVIJYUSC-UHFFFAOYSA-N
Data: 2 EC50
Activity Spreadsheet -- Enzyme Inhibition Constant Data from BindingDB
Found 2 hits for monomerid = 50334027
Trg + Lig
Ki
nM
ΔG°
kcal/mole
IC50
nM
Kd
nM
EC50/IC50
nM
koff
s-1
kon
M-1s-1
pHTemp
°C
Cannabinoid receptor 2
(Homo sapiens (Human))
BDBM50334027
(1-(3-(4-(2,3-dichlorophenyl)-1H-imidazol-2-yl)benz...)
Show SMILES CC1CCN(Cc2cccc(c2)-c2nc(c[nH]2)-c2cccc(Cl)c2Cl)CC1
Show InChI InChI=1S/C22H23Cl2N3/c1-15-8-10-27(11-9-15)14-16-4-2-5-17(12-16)22-25-13-20(26-22)18-6-3-7-19(23)21(18)24/h2-7,12-13,15H,8-11,14H2,1H3,(H,25,26)
Reactome pathway
n/an/an/an/a 25n/an/an/an/a
Merck Research Laboratory
Curated by ChEMBL
Assay Description
Agonist activity at human cloned CB2 receptor expressed in CHO cells assessed as inhibition of forskolin-induced cAMP accumulation
Bioorg Med Chem Lett 21: 182-5 (2010)
Article DOI: 10.1016/j.bmcl.2010.11.044
BindingDB Entry DOI: 10.7270/Q20P108G
Cannabinoid receptor 1
(Homo sapiens (Human))
BDBM50334027
(1-(3-(4-(2,3-dichlorophenyl)-1H-imidazol-2-yl)benz...)
Show SMILES CC1CCN(Cc2cccc(c2)-c2nc(c[nH]2)-c2cccc(Cl)c2Cl)CC1
Show InChI InChI=1S/C22H23Cl2N3/c1-15-8-10-27(11-9-15)14-16-4-2-5-17(12-16)22-25-13-20(26-22)18-6-3-7-19(23)21(18)24/h2-7,12-13,15H,8-11,14H2,1H3,(H,25,26)
NCI pathway
Reactome pathway
n/an/an/an/a>1.00E+4n/an/an/an/a
Merck Research Laboratory
Curated by ChEMBL
Assay Description
Agonist activity at human cloned CB1 receptor expressed in CHO cells assessed as inhibition of forskolin-induced cAMP accumulation
Bioorg Med Chem Lett 21: 182-5 (2010)
Article DOI: 10.1016/j.bmcl.2010.11.044
BindingDB Entry DOI: 10.7270/Q20P108G