BDBM50334039 (S)-3-methyl-4-(3-(4-(3-(trifluoromethyl)phenyl)-1H-imidazol-2-yl)benzyl)morpholine::CHEMBL1644678
SMILES: C[C@H]1COCCN1Cc1cccc(c1)-c1nc(c[nH]1)-c1cccc(c1)C(F)(F)F
InChI Key: InChIKey=HWCMNGZGIQKDGG-HNNXBMFYSA-N
Data: 1 EC50
Activity Spreadsheet -- Enzyme Inhibition Constant Data from BindingDB
Found 1 hit for monomerid = 50334039
Trg + Lig
Ki
nM
ΔG°
kcal/mole
IC50
nM
Kd
nM
EC50/IC50
nM
koff
s-1
kon
M-1s-1
pHTemp
°C
Cannabinoid receptor 2
(Homo sapiens (Human))
BDBM50334039
((S)-3-methyl-4-(3-(4-(3-(trifluoromethyl)phenyl)-1...)
Show SMILES C[C@H]1COCCN1Cc1cccc(c1)-c1nc(c[nH]1)-c1cccc(c1)C(F)(F)F |r|
Show InChI InChI=1S/C22H22F3N3O/c1-15-14-29-9-8-28(15)13-16-4-2-6-18(10-16)21-26-12-20(27-21)17-5-3-7-19(11-17)22(23,24)25/h2-7,10-12,15H,8-9,13-14H2,1H3,(H,26,27)/t15-/m0/s1
Reactome pathway
n/an/an/an/a 169n/an/an/an/a
Merck Research Laboratory
Curated by ChEMBL
Assay Description
Agonist activity at human cloned CB2 receptor expressed in CHO cells assessed as inhibition of forskolin-induced cAMP accumulation
Bioorg Med Chem Lett 21: 182-5 (2010)
Article DOI: 10.1016/j.bmcl.2010.11.044
BindingDB Entry DOI: 10.7270/Q20P108G