null
SMILES: COc1ccc(cc1C#Cc1nccs1)C(=O)N1CCN(CC1)c1ccccn1
InChI Key: InChIKey=RCQGDNPNQINBIG-UHFFFAOYSA-N
Activity Spreadsheet -- Enzyme Inhibition Constant Data from BindingDB
Found 2 hits for monomerid = 50334110
Trg + Lig
Ki
nM
ΔG°
kcal/mole
IC50
nM
Kd
nM
EC50/IC50
nM
koff
s-1
kon
M-1s-1
pHTemp
°C
Metabotropic glutamate receptor 5
(Rattus norvegicus (Rat))
BDBM50334110
((4-methoxy-3-(thiazol-2-ylethynyl)phenyl)(4-(pyrid...)
Show SMILES COc1ccc(cc1C#Cc1nccs1)C(=O)N1CCN(CC1)c1ccccn1
Show InChI InChI=1S/C22H20N4O2S/c1-28-19-7-5-18(16-17(19)6-8-21-24-10-15-29-21)22(27)26-13-11-25(12-14-26)20-4-2-3-9-23-20/h2-5,7,9-10,15-16H,11-14H2,1H3
Reactome pathway
24n/an/an/an/an/an/an/an/a
Pfizer Inc.
Curated by ChEMBL
Assay Description
Displacement of [3H]-MPEP from rat mGluR5 expressed in HEK293 cells
Bioorg Med Chem Lett 21: 195-9 (2010)
Article DOI: 10.1016/j.bmcl.2010.11.038
BindingDB Entry DOI: 10.7270/Q2GQ6Z02
Metabotropic glutamate receptor 5
(Rattus norvegicus (Rat))
BDBM50334110
((4-methoxy-3-(thiazol-2-ylethynyl)phenyl)(4-(pyrid...)
Show SMILES COc1ccc(cc1C#Cc1nccs1)C(=O)N1CCN(CC1)c1ccccn1
Show InChI InChI=1S/C22H20N4O2S/c1-28-19-7-5-18(16-17(19)6-8-21-24-10-15-29-21)22(27)26-13-11-25(12-14-26)20-4-2-3-9-23-20/h2-5,7,9-10,15-16H,11-14H2,1H3
Reactome pathway
n/an/a 6n/an/an/an/an/an/a
Pfizer Inc.
Curated by ChEMBL
Assay Description
Antagonist activity at rat mGluR5 expressed in HEK293 cells assessed as inhibition of L-glutamate-induced calcium mobilization by FLIPR assay
Bioorg Med Chem Lett 21: 195-9 (2010)
Article DOI: 10.1016/j.bmcl.2010.11.038
BindingDB Entry DOI: 10.7270/Q2GQ6Z02