BDBM50334142 (S)-4-(1-(1-(4-methylbenzyl)indoline-7-carboxamido)ethyl)benzoic acid::CHEMBL1645148
SMILES: C[C@H](NC(=O)c1cccc2CCN(Cc3ccc(C)cc3)c12)c1ccc(cc1)C(O)=O
InChI Key: InChIKey=OQEPHLRXPBNOGJ-SFHVURJKSA-N
Data: 1 KI  1 IC50
Activity Spreadsheet -- Enzyme Inhibition Constant Data from BindingDB
Found 2 hits for monomerid = 50334142
Trg + Lig
Ki
nM
ΔG°
kcal/mole
IC50
nM
Kd
nM
EC50/IC50
nM
koff
s-1
kon
M-1s-1
pHTemp
°C
Prostaglandin E2 receptor EP4 subtype
(Homo sapiens (Human))
BDBM50334142
((S)-4-(1-(1-(4-methylbenzyl)indoline-7-carboxamido...)
Show SMILES C[C@H](NC(=O)c1cccc2CCN(Cc3ccc(C)cc3)c12)c1ccc(cc1)C(O)=O |r|
Show InChI InChI=1S/C26H26N2O3/c1-17-6-8-19(9-7-17)16-28-15-14-21-4-3-5-23(24(21)28)25(29)27-18(2)20-10-12-22(13-11-20)26(30)31/h3-13,18H,14-16H2,1-2H3,(H,27,29)(H,30,31)/t18-/m0/s1
Reactome pathway
0.780n/an/an/an/an/an/an/an/a
Merck Frosst Canada Inc.
Curated by ChEMBL
Assay Description
Displacement of [3H]PGE2 from human prostanoid EP4 receptor expressed in HEK293-EBNA cells after 60 mins by scintillation counting
Bioorg Med Chem Lett 21: 484-7 (2010)
Article DOI: 10.1016/j.bmcl.2010.10.106
BindingDB Entry DOI: 10.7270/Q2BZ6695
Prostaglandin E2 receptor EP4 subtype
(Homo sapiens (Human))
BDBM50334142
((S)-4-(1-(1-(4-methylbenzyl)indoline-7-carboxamido...)
Show SMILES C[C@H](NC(=O)c1cccc2CCN(Cc3ccc(C)cc3)c12)c1ccc(cc1)C(O)=O |r|
Show InChI InChI=1S/C26H26N2O3/c1-17-6-8-19(9-7-17)16-28-15-14-21-4-3-5-23(24(21)28)25(29)27-18(2)20-10-12-22(13-11-20)26(30)31/h3-13,18H,14-16H2,1-2H3,(H,27,29)(H,30,31)/t18-/m0/s1
Reactome pathway
n/an/a 5.80n/an/an/an/an/an/a
Merck Frosst Canada Inc.
Curated by ChEMBL
Assay Description
Antagonist activity at human prostanoid EP4 receptor expressed in HEK293 cells assessed as inhibition of PGE2-induced cAMP accumulation by scintillat...
Bioorg Med Chem Lett 21: 484-7 (2010)
Article DOI: 10.1016/j.bmcl.2010.10.106
BindingDB Entry DOI: 10.7270/Q2BZ6695