BDBM50334195 4-Chloro-3-[(imidazolidin-2-yl)imino]indazole hydrochloride::CHEMBL1641681
SMILES: Clc1cccc2n[nH]c(N=C3NCCN3)c12
InChI Key: InChIKey=GZOSTMMHWPNBSI-UHFFFAOYSA-N
Data: 1 KI  1 IC50  1 EC50
Activity Spreadsheet -- Enzyme Inhibition Constant Data from BindingDB
Found 3 hits for monomerid = 50334195
Trg + Lig
Ki
nM
ΔG°
kcal/mole
IC50
nM
Kd
nM
EC50/IC50
nM
koff
s-1
kon
M-1s-1
pHTemp
°C
Imidazoline I1
(RAT)
BDBM50334195
(4-Chloro-3-[(imidazolidin-2-yl)imino]indazole hydr...)
Show SMILES Clc1cccc2n[nH]c(N=C3NCCN3)c12 |(20.22,-2.74,;20.26,-1.21,;18.95,-.4,;18.99,1.14,;20.34,1.87,;21.66,1.07,;23.13,1.5,;24.01,.23,;23.07,-.99,;23.88,-2.31,;25.41,-2.28,;26.29,-1.01,;27.77,-1.45,;27.8,-2.99,;26.34,-3.5,;21.62,-.47,)|
Show InChI InChI=1S/C10H10ClN5/c11-6-2-1-3-7-8(6)9(16-15-7)14-10-12-4-5-13-10/h1-3H,4-5H2,(H3,12,13,14,15,16)
45.2n/an/an/an/an/an/an/an/a
Medical University of Gdansk
Curated by ChEMBL
Assay Description
Displacement of [3H]2BFI from imidazoline I1 receptor in Sprague-Dawley rat brain membrane after 45 mins by liquid scintillation counting
Bioorg Med Chem 19: 321-9 (2011)
Article DOI: 10.1016/j.bmc.2010.11.020
BindingDB Entry DOI: 10.7270/Q2FQ9WX5
Alpha-2A adrenergic receptor
(Homo sapiens (Human))
BDBM50334195
(4-Chloro-3-[(imidazolidin-2-yl)imino]indazole hydr...)
Show SMILES Clc1cccc2n[nH]c(N=C3NCCN3)c12 |(20.22,-2.74,;20.26,-1.21,;18.95,-.4,;18.99,1.14,;20.34,1.87,;21.66,1.07,;23.13,1.5,;24.01,.23,;23.07,-.99,;23.88,-2.31,;25.41,-2.28,;26.29,-1.01,;27.77,-1.45,;27.8,-2.99,;26.34,-3.5,;21.62,-.47,)|
Show InChI InChI=1S/C10H10ClN5/c11-6-2-1-3-7-8(6)9(16-15-7)14-10-12-4-5-13-10/h1-3H,4-5H2,(H3,12,13,14,15,16)
n/an/an/an/a 240n/an/an/an/a
Medical University of Gdansk
Curated by ChEMBL
Assay Description
Agonist activity at human recombinant alpha2A adrenergic receptor expressed in CHO cells assessed as induction of [35S]GTPgammaS binding after 60 min...
Bioorg Med Chem 19: 321-9 (2011)
Article DOI: 10.1016/j.bmc.2010.11.020
BindingDB Entry DOI: 10.7270/Q2FQ9WX5
Imidazoline I1
(RAT)
BDBM50334195
(4-Chloro-3-[(imidazolidin-2-yl)imino]indazole hydr...)
Show SMILES Clc1cccc2n[nH]c(N=C3NCCN3)c12 |(20.22,-2.74,;20.26,-1.21,;18.95,-.4,;18.99,1.14,;20.34,1.87,;21.66,1.07,;23.13,1.5,;24.01,.23,;23.07,-.99,;23.88,-2.31,;25.41,-2.28,;26.29,-1.01,;27.77,-1.45,;27.8,-2.99,;26.34,-3.5,;21.62,-.47,)|
Show InChI InChI=1S/C10H10ClN5/c11-6-2-1-3-7-8(6)9(16-15-7)14-10-12-4-5-13-10/h1-3H,4-5H2,(H3,12,13,14,15,16)
n/an/a 1.84E+3n/an/an/an/an/an/a
Medical University of Gdansk
Curated by ChEMBL
Assay Description
Displacement of [3H]clonidine from imidazoline I1 receptor in Sprague-Dawley rat kidney membrane after 45 mins by liquid scintillation counting
Bioorg Med Chem 19: 321-9 (2011)
Article DOI: 10.1016/j.bmc.2010.11.020
BindingDB Entry DOI: 10.7270/Q2FQ9WX5