BDBM50334448 (S)-2-isobutyl-7-(quinuclidin-3-yl)-7,8-dihydropyrazolo[3,4,5-de]isoquinolin-6(2H)-one::CHEMBL1641625::US8501729, 9
SMILES: CC(C)Cn1[nH]c2cn([C@@H]3CN4CCC3CC4)c(=O)c3cccc1c23
InChI Key: InChIKey=HPMOOCNWTGBYIG-GOSISDBHSA-N
Data: 2 KI
Activity Spreadsheet -- Enzyme Inhibition Constant Data from BindingDB
Found 2 hits for monomerid = 50334448
Trg + Lig
Ki
nM
ΔG°
kcal/mole
IC50
nM
Kd
nM
EC50/IC50
nM
koff
s-1
kon
M-1s-1
pHTemp
°C
5-hydroxytryptamine receptor 3A
(Homo sapiens (Human))
BDBM50334448
((S)-2-isobutyl-7-(quinuclidin-3-yl)-7,8-dihydropyr...)
Show SMILES CC(C)Cn1[nH]c2cn([C@@H]3CN4CCC3CC4)c(=O)c3cccc1c23 |r,wD:9.8,(15.89,-21.07,;15.34,-19.64,;13.82,-19.39,;16.31,-18.44,;15.77,-17.01,;16.79,-15.26,;15.64,-14.22,;15.64,-12.68,;14.3,-11.91,;14.3,-10.37,;12.97,-9.61,;12.97,-8.07,;14.3,-7.3,;15.63,-8.07,;15.63,-9.6,;14.13,-9.1,;14.45,-8.46,;12.98,-12.68,;11.63,-11.89,;12.98,-14.22,;11.64,-14.99,;11.64,-16.54,;12.98,-17.31,;14.31,-16.54,;14.31,-14.99,)|
Show InChI InChI=1S/C20H26N4O/c1-13(2)10-24-17-5-3-4-15-19(17)16(21-24)11-23(20(15)25)18-12-22-8-6-14(18)7-9-22/h3-5,11,13-14,18,21H,6-10,12H2,1-2H3/t18-/m1/s1
Reactome pathway
US Patent
2n/an/an/an/an/an/a7.5n/a
Albany Molecular Research, Inc.
US Patent
Assay Description
The relative affinity of the various compounds for the human 5-HT3 receptor was measured in a radioligand binding assay, using a scintillation proxim...
US Patent US8501729 (2013)
BindingDB Entry DOI: 10.7270/Q2JW8CHV
5-hydroxytryptamine receptor 3A
(Homo sapiens (Human))
BDBM50334448
((S)-2-isobutyl-7-(quinuclidin-3-yl)-7,8-dihydropyr...)
Show SMILES CC(C)Cn1[nH]c2cn([C@@H]3CN4CCC3CC4)c(=O)c3cccc1c23 |r,wD:9.8,(15.89,-21.07,;15.34,-19.64,;13.82,-19.39,;16.31,-18.44,;15.77,-17.01,;16.79,-15.26,;15.64,-14.22,;15.64,-12.68,;14.3,-11.91,;14.3,-10.37,;12.97,-9.61,;12.97,-8.07,;14.3,-7.3,;15.63,-8.07,;15.63,-9.6,;14.13,-9.1,;14.45,-8.46,;12.98,-12.68,;11.63,-11.89,;12.98,-14.22,;11.64,-14.99,;11.64,-16.54,;12.98,-17.31,;14.31,-16.54,;14.31,-14.99,)|
Show InChI InChI=1S/C20H26N4O/c1-13(2)10-24-17-5-3-4-15-19(17)16(21-24)11-23(20(15)25)18-12-22-8-6-14(18)7-9-22/h3-5,11,13-14,18,21H,6-10,12H2,1-2H3/t18-/m1/s1
Reactome pathway
2.40n/an/an/an/an/an/an/an/a
AMRI
Curated by ChEMBL
Assay Description
Binding affinity to human 5HT3A receptor
Bioorg Med Chem Lett 21: 58-61 (2010)
Article DOI: 10.1016/j.bmcl.2010.11.080
BindingDB Entry DOI: 10.7270/Q2474B4Q