BDBM50334565 CHEMBL1641943::N3-(1-(3,5-Dimethyl)adamantyl)-4-oxo-1-pentyl-6-phenyl-1,4-dihydropyridine-3-carboxamide
SMILES: CCCCCn1cc(C(=O)NCC23CC4CC(C)(CC(C)(C4)C2)C3)c(=O)cc1-c1ccccc1
InChI Key: InChIKey=RRNZJIUGNONERQ-UHFFFAOYSA-N
Data: 2 KI  1 EC50
Activity Spreadsheet -- Enzyme Inhibition Constant Data from BindingDB
Found 3 hits for monomerid = 50334565
Trg + Lig
Ki
nM
ΔG°
kcal/mole
IC50
nM
Kd
nM
EC50/IC50
nM
koff
s-1
kon
M-1s-1
pHTemp
°C
Cannabinoid receptor 2
(Homo sapiens (Human))
BDBM50334565
(CHEMBL1641943 | N3-(1-(3,5-Dimethyl)adamantyl)-4-o...)
Show SMILES CCCCCn1cc(C(=O)NCC23CC4CC(C)(CC(C)(C4)C2)C3)c(=O)cc1-c1ccccc1 |TLB:20:19:15:23.13.12,11:12:15.14.21:18,THB:13:14:18:23.12.22,13:12:15.14.21:18,11:12:15:21.19.18,22:12:15:21.19.18,22:19:15:23.13.12|
Show InChI InChI=1S/C30H40N2O2/c1-4-5-9-12-32-17-24(26(33)13-25(32)23-10-7-6-8-11-23)27(34)31-21-30-16-22-14-28(2,19-30)18-29(3,15-22)20-30/h6-8,10-11,13,17,22H,4-5,9,12,14-16,18-21H2,1-3H3,(H,31,34)
Reactome pathway
6.60n/an/an/an/an/an/an/an/a
Universite£? Lille-Nord de France
Curated by ChEMBL
Assay Description
Displacement of [3H]-CP55940 from human CB2 receptor expressed in CHO cells after 1 hr
J Med Chem 53: 7918-31 (2010)
Article DOI: 10.1021/jm100286k
BindingDB Entry DOI: 10.7270/Q2BR8SFP
Cannabinoid receptor 1
(Homo sapiens (Human))
BDBM50334565
(CHEMBL1641943 | N3-(1-(3,5-Dimethyl)adamantyl)-4-o...)
Show SMILES CCCCCn1cc(C(=O)NCC23CC4CC(C)(CC(C)(C4)C2)C3)c(=O)cc1-c1ccccc1 |TLB:20:19:15:23.13.12,11:12:15.14.21:18,THB:13:14:18:23.12.22,13:12:15.14.21:18,11:12:15:21.19.18,22:12:15:21.19.18,22:19:15:23.13.12|
Show InChI InChI=1S/C30H40N2O2/c1-4-5-9-12-32-17-24(26(33)13-25(32)23-10-7-6-8-11-23)27(34)31-21-30-16-22-14-28(2,19-30)18-29(3,15-22)20-30/h6-8,10-11,13,17,22H,4-5,9,12,14-16,18-21H2,1-3H3,(H,31,34)
NCI pathway
Reactome pathway
454n/an/an/an/an/an/an/an/a
Universite£? Lille-Nord de France
Curated by ChEMBL
Assay Description
Displacement of [3H]-SR141716A from human CB1 receptor expressed in CHO cells after 1 hr
J Med Chem 53: 7918-31 (2010)
Article DOI: 10.1021/jm100286k
BindingDB Entry DOI: 10.7270/Q2BR8SFP
Cannabinoid receptor 2
(Homo sapiens (Human))
BDBM50334565
(CHEMBL1641943 | N3-(1-(3,5-Dimethyl)adamantyl)-4-o...)
Show SMILES CCCCCn1cc(C(=O)NCC23CC4CC(C)(CC(C)(C4)C2)C3)c(=O)cc1-c1ccccc1 |TLB:20:19:15:23.13.12,11:12:15.14.21:18,THB:13:14:18:23.12.22,13:12:15.14.21:18,11:12:15:21.19.18,22:12:15:21.19.18,22:19:15:23.13.12|
Show InChI InChI=1S/C30H40N2O2/c1-4-5-9-12-32-17-24(26(33)13-25(32)23-10-7-6-8-11-23)27(34)31-21-30-16-22-14-28(2,19-30)18-29(3,15-22)20-30/h6-8,10-11,13,17,22H,4-5,9,12,14-16,18-21H2,1-3H3,(H,31,34)
Reactome pathway
n/an/an/an/a 5.80n/an/an/an/a
Universite£? Lille-Nord de France
Curated by ChEMBL
Assay Description
Agonist activity at human CB2 receptor expressed in CHO cells assessed as stimulation of [35S]-GTPgammaS binding
J Med Chem 53: 7918-31 (2010)
Article DOI: 10.1021/jm100286k
BindingDB Entry DOI: 10.7270/Q2BR8SFP