BDBM50334659 8-Methoxy-2-methyl-5-((1-methyl-4-phenyl-1H-imidazol-2-ylthio)methyl)pyrazolo[1,5-c]quinazoline::CHEMBL1642575
SMILES: COc1ccc2c3cc(C)nn3c(CSc3nc(cn3C)-c3ccccc3)nc2c1
InChI Key: InChIKey=INOKWGGMXVYSMK-UHFFFAOYSA-N
Data: 1 IC50
Activity Spreadsheet -- Enzyme Inhibition Constant Data from BindingDB
Found 1 hit for monomerid = 50334659
Trg + Lig
Ki
nM
ΔG°
kcal/mole
IC50
nM
Kd
nM
EC50/IC50
nM
koff
s-1
kon
M-1s-1
pHTemp
°C
cAMP and cAMP-inhibited cGMP 3',5'-cyclic phosphodiesterase 10A
(Homo sapiens (Human))
BDBM50334659
(8-Methoxy-2-methyl-5-((1-methyl-4-phenyl-1H-imidaz...)
Show SMILES COc1ccc2c3cc(C)nn3c(CSc3nc(cn3C)-c3ccccc3)nc2c1
Show InChI InChI=1S/C23H21N5OS/c1-15-11-21-18-10-9-17(29-3)12-19(18)24-22(28(21)26-15)14-30-23-25-20(13-27(23)2)16-7-5-4-6-8-16/h4-13H,14H2,1-3H3
Reactome pathway
n/an/a 100n/an/an/an/an/an/a
Universit£ di Sassari
Curated by ChEMBL
Assay Description
Inhibition of human PDE10A expressed in Sf9 cells using [3H]cAMP by scintillation proximity assay
Bioorg Med Chem 19: 642-9 (2011)
Article DOI: 10.1016/j.bmc.2010.10.038
BindingDB Entry DOI: 10.7270/Q2TT4R73