BDBM50334673 CHEMBL1642593::N-((4S)-4-(3-amino-3-oxopropyl)-4-phenylcyclohexyl)-N-cyclopropyl-4-((S)-1,1,1-trifluoro-2-hydroxypropan-2-yl)benzamide
SMILES: C[C@](O)(c1ccc(cc1)C(=O)N(C1CC1)[C@H]1CC[C@@](CCC(N)=O)(CC1)c1ccccc1)C(F)(F)F
InChI Key: InChIKey=GGXWRFSOCBTDDI-YGPDHOBYSA-N
Data: 4 IC50
PDB links: 1 PDB ID matches this monomer.
Activity Spreadsheet -- Enzyme Inhibition Constant Data from BindingDB
Found 4 hits for monomerid = 50334673
Trg + Lig
Ki
nM
ΔG°
kcal/mole
IC50
nM
Kd
nM
EC50/IC50
nM
koff
s-1
kon
M-1s-1
pHTemp
°C
11-beta-hydroxysteroid dehydrogenase 1
(Homo sapiens (Human))
BDBM50334673
(CHEMBL1642593 | N-((4S)-4-(3-amino-3-oxopropyl)-4-...)
Show SMILES C[C@](O)(c1ccc(cc1)C(=O)N(C1CC1)[C@H]1CC[C@@](CCC(N)=O)(CC1)c1ccccc1)C(F)(F)F |r,wU:1.0,15.16,wD:1.1,18.28,(8.32,-10.39,;9.65,-9.61,;8.16,-9.22,;10.99,-10.38,;12.32,-9.6,;13.66,-10.37,;13.66,-11.91,;12.34,-12.68,;11,-11.93,;14.99,-12.67,;15,-14.22,;16.33,-11.9,;16.32,-10.36,;17.09,-9.03,;15.55,-9.03,;17.66,-12.67,;18.99,-11.89,;20.32,-12.67,;20.32,-14.21,;21.65,-13.43,;22.99,-14.19,;24.32,-13.41,;25.66,-14.17,;24.31,-11.87,;18.99,-14.97,;17.66,-14.21,;21.08,-15.54,;20.3,-16.86,;21.06,-18.19,;22.59,-18.2,;23.36,-16.87,;22.6,-15.55,;9.65,-8.07,;10.98,-7.29,;8.31,-7.3,;9.24,-6.58,)|
Show InChI InChI=1S/C28H33F3N2O3/c1-26(36,28(29,30)31)20-9-7-19(8-10-20)25(35)33(22-11-12-22)23-13-16-27(17-14-23,18-15-24(32)34)21-5-3-2-4-6-21/h2-10,22-23,36H,11-18H2,1H3,(H2,32,34)/t23-,26-,27-/m0/s1
Reactome pathway
n/an/a 0.800n/an/an/an/an/an/a
Amgen Inc
Curated by ChEMBL
Assay Description
Inhibition of human full length 11beta-HSD1 assessed as inhibition of conversion of [3H]cortisone to [3H]cortisol by scintillation proximity assay
Bioorg Med Chem Lett 21: 405-10 (2010)
Article DOI: 10.1016/j.bmcl.2010.10.129
BindingDB Entry DOI: 10.7270/Q2K937SB
3D
3D Structure (crystal)
11-beta-hydroxysteroid dehydrogenase 1
(Homo sapiens (Human))
BDBM50334673
(CHEMBL1642593 | N-((4S)-4-(3-amino-3-oxopropyl)-4-...)
Show SMILES C[C@](O)(c1ccc(cc1)C(=O)N(C1CC1)[C@H]1CC[C@@](CCC(N)=O)(CC1)c1ccccc1)C(F)(F)F |r,wU:1.0,15.16,wD:1.1,18.28,(8.32,-10.39,;9.65,-9.61,;8.16,-9.22,;10.99,-10.38,;12.32,-9.6,;13.66,-10.37,;13.66,-11.91,;12.34,-12.68,;11,-11.93,;14.99,-12.67,;15,-14.22,;16.33,-11.9,;16.32,-10.36,;17.09,-9.03,;15.55,-9.03,;17.66,-12.67,;18.99,-11.89,;20.32,-12.67,;20.32,-14.21,;21.65,-13.43,;22.99,-14.19,;24.32,-13.41,;25.66,-14.17,;24.31,-11.87,;18.99,-14.97,;17.66,-14.21,;21.08,-15.54,;20.3,-16.86,;21.06,-18.19,;22.59,-18.2,;23.36,-16.87,;22.6,-15.55,;9.65,-8.07,;10.98,-7.29,;8.31,-7.3,;9.24,-6.58,)|
Show InChI InChI=1S/C28H33F3N2O3/c1-26(36,28(29,30)31)20-9-7-19(8-10-20)25(35)33(22-11-12-22)23-13-16-27(17-14-23,18-15-24(32)34)21-5-3-2-4-6-21/h2-10,22-23,36H,11-18H2,1H3,(H2,32,34)/t23-,26-,27-/m0/s1
Reactome pathway
n/an/a 17n/an/an/an/an/an/a
Amgen Inc
Curated by ChEMBL
Assay Description
Inhibition of human recombinant full length 11beta-HSD1 expressed in human adipocytes assessed as inhibition of conversion of [3H]cortisone to [3H]co...
Bioorg Med Chem Lett 21: 405-10 (2010)
Article DOI: 10.1016/j.bmcl.2010.10.129
BindingDB Entry DOI: 10.7270/Q2K937SB
3D
3D Structure (crystal)
11-beta-hydroxysteroid dehydrogenase 1
(Homo sapiens (Human))
BDBM50334673
(CHEMBL1642593 | N-((4S)-4-(3-amino-3-oxopropyl)-4-...)
Show SMILES C[C@](O)(c1ccc(cc1)C(=O)N(C1CC1)[C@H]1CC[C@@](CCC(N)=O)(CC1)c1ccccc1)C(F)(F)F |r,wU:1.0,15.16,wD:1.1,18.28,(8.32,-10.39,;9.65,-9.61,;8.16,-9.22,;10.99,-10.38,;12.32,-9.6,;13.66,-10.37,;13.66,-11.91,;12.34,-12.68,;11,-11.93,;14.99,-12.67,;15,-14.22,;16.33,-11.9,;16.32,-10.36,;17.09,-9.03,;15.55,-9.03,;17.66,-12.67,;18.99,-11.89,;20.32,-12.67,;20.32,-14.21,;21.65,-13.43,;22.99,-14.19,;24.32,-13.41,;25.66,-14.17,;24.31,-11.87,;18.99,-14.97,;17.66,-14.21,;21.08,-15.54,;20.3,-16.86,;21.06,-18.19,;22.59,-18.2,;23.36,-16.87,;22.6,-15.55,;9.65,-8.07,;10.98,-7.29,;8.31,-7.3,;9.24,-6.58,)|
Show InChI InChI=1S/C28H33F3N2O3/c1-26(36,28(29,30)31)20-9-7-19(8-10-20)25(35)33(22-11-12-22)23-13-16-27(17-14-23,18-15-24(32)34)21-5-3-2-4-6-21/h2-10,22-23,36H,11-18H2,1H3,(H2,32,34)/t23-,26-,27-/m0/s1
Reactome pathway
n/an/a 3.90n/an/an/an/an/an/a
Amgen Inc
Curated by ChEMBL
Assay Description
Inhibition of human recombinant full length 11beta-HSD1 expressed in HEK293 cells assessed as inhibition of conversion of [3H]cortisone to [3H]cortis...
Bioorg Med Chem Lett 21: 405-10 (2010)
Article DOI: 10.1016/j.bmcl.2010.10.129
BindingDB Entry DOI: 10.7270/Q2K937SB
3D
3D Structure (crystal)
11-beta-hydroxysteroid dehydrogenase 1
(Homo sapiens (Human))
BDBM50334673
(CHEMBL1642593 | N-((4S)-4-(3-amino-3-oxopropyl)-4-...)
Show SMILES C[C@](O)(c1ccc(cc1)C(=O)N(C1CC1)[C@H]1CC[C@@](CCC(N)=O)(CC1)c1ccccc1)C(F)(F)F |r,wU:1.0,15.16,wD:1.1,18.28,(8.32,-10.39,;9.65,-9.61,;8.16,-9.22,;10.99,-10.38,;12.32,-9.6,;13.66,-10.37,;13.66,-11.91,;12.34,-12.68,;11,-11.93,;14.99,-12.67,;15,-14.22,;16.33,-11.9,;16.32,-10.36,;17.09,-9.03,;15.55,-9.03,;17.66,-12.67,;18.99,-11.89,;20.32,-12.67,;20.32,-14.21,;21.65,-13.43,;22.99,-14.19,;24.32,-13.41,;25.66,-14.17,;24.31,-11.87,;18.99,-14.97,;17.66,-14.21,;21.08,-15.54,;20.3,-16.86,;21.06,-18.19,;22.59,-18.2,;23.36,-16.87,;22.6,-15.55,;9.65,-8.07,;10.98,-7.29,;8.31,-7.3,;9.24,-6.58,)|
Show InChI InChI=1S/C28H33F3N2O3/c1-26(36,28(29,30)31)20-9-7-19(8-10-20)25(35)33(22-11-12-22)23-13-16-27(17-14-23,18-15-24(32)34)21-5-3-2-4-6-21/h2-10,22-23,36H,11-18H2,1H3,(H2,32,34)/t23-,26-,27-/m0/s1
Reactome pathway
n/an/a 37n/an/an/an/an/an/a
Amgen Inc
Curated by ChEMBL
Assay Description
Inhibition of human recombinant full length 11beta-HSD1 expressed in HEK293 cells assessed as inhibition of conversion of [3H]cortisone to [3H]cortis...
Bioorg Med Chem Lett 21: 405-10 (2010)
Article DOI: 10.1016/j.bmcl.2010.10.129
BindingDB Entry DOI: 10.7270/Q2K937SB
3D
3D Structure (crystal)