BDBM50334680 ((1R)-4-(N-cyclopropyl-4-((S)-1,1,1-trifluoro-2-hydroxypropan-2-yl)benzamido)-1-(2-fluorophenyl)cyclohexyl)methyl carbamate::CHEMBL1642600
SMILES: C[C@](O)(c1ccc(cc1)C(=O)N(C1CC1)[C@H]1CC[C@@](COC(N)=O)(CC1)c1ccccc1F)C(F)(F)F
InChI Key: InChIKey=XKUMUYGOIJXCQV-XZZVZQAVSA-N
Data: 5 IC50
Activity Spreadsheet -- Enzyme Inhibition Constant Data from BindingDB
Found 5 hits for monomerid = 50334680
Trg + Lig
Ki
nM
ΔG°
kcal/mole
IC50
nM
Kd
nM
EC50/IC50
nM
koff
s-1
kon
M-1s-1
pHTemp
°C
11-beta-hydroxysteroid dehydrogenase 1
(Homo sapiens (Human))
BDBM50334680
(((1R)-4-(N-cyclopropyl-4-((S)-1,1,1-trifluoro-2-hy...)
Show SMILES C[C@](O)(c1ccc(cc1)C(=O)N(C1CC1)[C@H]1CC[C@@](COC(N)=O)(CC1)c1ccccc1F)C(F)(F)F |r,wU:1.0,15.16,wD:1.1,18.28,(10.24,-34.27,;11.57,-33.49,;10.08,-33.1,;12.91,-34.25,;14.24,-33.48,;15.58,-34.25,;15.57,-35.79,;14.25,-36.56,;12.92,-35.8,;16.91,-36.55,;16.91,-38.09,;18.24,-35.78,;18.24,-34.24,;19.01,-32.91,;17.46,-32.91,;19.58,-36.54,;20.91,-35.77,;22.24,-36.54,;22.24,-38.09,;23.66,-37.51,;24.88,-38.45,;26.31,-37.87,;27.53,-38.82,;26.52,-36.34,;20.91,-38.85,;19.58,-38.09,;23,-39.42,;24.52,-39.42,;25.28,-40.75,;24.51,-42.08,;22.97,-42.07,;22.22,-40.74,;20.68,-40.73,;11.56,-31.95,;12.89,-31.17,;10.22,-31.18,;11.16,-30.46,)|
Show InChI InChI=1S/C27H30F4N2O4/c1-25(36,27(29,30)31)18-8-6-17(7-9-18)23(34)33(19-10-11-19)20-12-14-26(15-13-20,16-37-24(32)35)21-4-2-3-5-22(21)28/h2-9,19-20,36H,10-16H2,1H3,(H2,32,35)/t20-,25-,26-/m0/s1
Reactome pathway
n/an/a 0.600n/an/an/an/an/an/a
Amgen Inc
Curated by ChEMBL
Assay Description
Inhibition of human full length 11beta-HSD1 assessed as inhibition of conversion of [3H]cortisone to [3H]cortisol by scintillation proximity assay
Bioorg Med Chem Lett 21: 405-10 (2010)
Article DOI: 10.1016/j.bmcl.2010.10.129
BindingDB Entry DOI: 10.7270/Q2K937SB
11-beta-hydroxysteroid dehydrogenase 1
(Homo sapiens (Human))
BDBM50334680
(((1R)-4-(N-cyclopropyl-4-((S)-1,1,1-trifluoro-2-hy...)
Show SMILES C[C@](O)(c1ccc(cc1)C(=O)N(C1CC1)[C@H]1CC[C@@](COC(N)=O)(CC1)c1ccccc1F)C(F)(F)F |r,wU:1.0,15.16,wD:1.1,18.28,(10.24,-34.27,;11.57,-33.49,;10.08,-33.1,;12.91,-34.25,;14.24,-33.48,;15.58,-34.25,;15.57,-35.79,;14.25,-36.56,;12.92,-35.8,;16.91,-36.55,;16.91,-38.09,;18.24,-35.78,;18.24,-34.24,;19.01,-32.91,;17.46,-32.91,;19.58,-36.54,;20.91,-35.77,;22.24,-36.54,;22.24,-38.09,;23.66,-37.51,;24.88,-38.45,;26.31,-37.87,;27.53,-38.82,;26.52,-36.34,;20.91,-38.85,;19.58,-38.09,;23,-39.42,;24.52,-39.42,;25.28,-40.75,;24.51,-42.08,;22.97,-42.07,;22.22,-40.74,;20.68,-40.73,;11.56,-31.95,;12.89,-31.17,;10.22,-31.18,;11.16,-30.46,)|
Show InChI InChI=1S/C27H30F4N2O4/c1-25(36,27(29,30)31)18-8-6-17(7-9-18)23(34)33(19-10-11-19)20-12-14-26(15-13-20,16-37-24(32)35)21-4-2-3-5-22(21)28/h2-9,19-20,36H,10-16H2,1H3,(H2,32,35)/t20-,25-,26-/m0/s1
Reactome pathway
n/an/a 135n/an/an/an/an/an/a
Amgen Inc
Curated by ChEMBL
Assay Description
Inhibition of human recombinant full length 11beta-HSD1 expressed in HEK293 cells assessed as inhibition of conversion of [3H]cortisone to [3H]cortis...
Bioorg Med Chem Lett 21: 405-10 (2010)
Article DOI: 10.1016/j.bmcl.2010.10.129
BindingDB Entry DOI: 10.7270/Q2K937SB
11-beta-Hydroxysteroid Dehydrogenase 1 (11-beta-HSD1)
(Rattus norvegicus (rat))
BDBM50334680
(((1R)-4-(N-cyclopropyl-4-((S)-1,1,1-trifluoro-2-hy...)
Show SMILES C[C@](O)(c1ccc(cc1)C(=O)N(C1CC1)[C@H]1CC[C@@](COC(N)=O)(CC1)c1ccccc1F)C(F)(F)F |r,wU:1.0,15.16,wD:1.1,18.28,(10.24,-34.27,;11.57,-33.49,;10.08,-33.1,;12.91,-34.25,;14.24,-33.48,;15.58,-34.25,;15.57,-35.79,;14.25,-36.56,;12.92,-35.8,;16.91,-36.55,;16.91,-38.09,;18.24,-35.78,;18.24,-34.24,;19.01,-32.91,;17.46,-32.91,;19.58,-36.54,;20.91,-35.77,;22.24,-36.54,;22.24,-38.09,;23.66,-37.51,;24.88,-38.45,;26.31,-37.87,;27.53,-38.82,;26.52,-36.34,;20.91,-38.85,;19.58,-38.09,;23,-39.42,;24.52,-39.42,;25.28,-40.75,;24.51,-42.08,;22.97,-42.07,;22.22,-40.74,;20.68,-40.73,;11.56,-31.95,;12.89,-31.17,;10.22,-31.18,;11.16,-30.46,)|
Show InChI InChI=1S/C27H30F4N2O4/c1-25(36,27(29,30)31)18-8-6-17(7-9-18)23(34)33(19-10-11-19)20-12-14-26(15-13-20,16-37-24(32)35)21-4-2-3-5-22(21)28/h2-9,19-20,36H,10-16H2,1H3,(H2,32,35)/t20-,25-,26-/m0/s1
n/an/a 144n/an/an/an/an/an/a
Amgen Inc
Curated by ChEMBL
Assay Description
Inhibition of rat 11beta-HSD1 assessed as inhibition of conversion of [3H]cortisone to [3H]cortisol by scintillation proximity assay
Bioorg Med Chem Lett 21: 405-10 (2010)
Article DOI: 10.1016/j.bmcl.2010.10.129
BindingDB Entry DOI: 10.7270/Q2K937SB
11-beta-hydroxysteroid dehydrogenase 1
(Homo sapiens (Human))
BDBM50334680
(((1R)-4-(N-cyclopropyl-4-((S)-1,1,1-trifluoro-2-hy...)
Show SMILES C[C@](O)(c1ccc(cc1)C(=O)N(C1CC1)[C@H]1CC[C@@](COC(N)=O)(CC1)c1ccccc1F)C(F)(F)F |r,wU:1.0,15.16,wD:1.1,18.28,(10.24,-34.27,;11.57,-33.49,;10.08,-33.1,;12.91,-34.25,;14.24,-33.48,;15.58,-34.25,;15.57,-35.79,;14.25,-36.56,;12.92,-35.8,;16.91,-36.55,;16.91,-38.09,;18.24,-35.78,;18.24,-34.24,;19.01,-32.91,;17.46,-32.91,;19.58,-36.54,;20.91,-35.77,;22.24,-36.54,;22.24,-38.09,;23.66,-37.51,;24.88,-38.45,;26.31,-37.87,;27.53,-38.82,;26.52,-36.34,;20.91,-38.85,;19.58,-38.09,;23,-39.42,;24.52,-39.42,;25.28,-40.75,;24.51,-42.08,;22.97,-42.07,;22.22,-40.74,;20.68,-40.73,;11.56,-31.95,;12.89,-31.17,;10.22,-31.18,;11.16,-30.46,)|
Show InChI InChI=1S/C27H30F4N2O4/c1-25(36,27(29,30)31)18-8-6-17(7-9-18)23(34)33(19-10-11-19)20-12-14-26(15-13-20,16-37-24(32)35)21-4-2-3-5-22(21)28/h2-9,19-20,36H,10-16H2,1H3,(H2,32,35)/t20-,25-,26-/m0/s1
Reactome pathway
n/an/a 5.70n/an/an/an/an/an/a
Amgen Inc
Curated by ChEMBL
Assay Description
Inhibition of human recombinant full length 11beta-HSD1 expressed in HEK293 cells assessed as inhibition of conversion of [3H]cortisone to [3H]cortis...
Bioorg Med Chem Lett 21: 405-10 (2010)
Article DOI: 10.1016/j.bmcl.2010.10.129
BindingDB Entry DOI: 10.7270/Q2K937SB
11-beta-hydroxysteroid dehydrogenase 1
(Homo sapiens (Human))
BDBM50334680
(((1R)-4-(N-cyclopropyl-4-((S)-1,1,1-trifluoro-2-hy...)
Show SMILES C[C@](O)(c1ccc(cc1)C(=O)N(C1CC1)[C@H]1CC[C@@](COC(N)=O)(CC1)c1ccccc1F)C(F)(F)F |r,wU:1.0,15.16,wD:1.1,18.28,(10.24,-34.27,;11.57,-33.49,;10.08,-33.1,;12.91,-34.25,;14.24,-33.48,;15.58,-34.25,;15.57,-35.79,;14.25,-36.56,;12.92,-35.8,;16.91,-36.55,;16.91,-38.09,;18.24,-35.78,;18.24,-34.24,;19.01,-32.91,;17.46,-32.91,;19.58,-36.54,;20.91,-35.77,;22.24,-36.54,;22.24,-38.09,;23.66,-37.51,;24.88,-38.45,;26.31,-37.87,;27.53,-38.82,;26.52,-36.34,;20.91,-38.85,;19.58,-38.09,;23,-39.42,;24.52,-39.42,;25.28,-40.75,;24.51,-42.08,;22.97,-42.07,;22.22,-40.74,;20.68,-40.73,;11.56,-31.95,;12.89,-31.17,;10.22,-31.18,;11.16,-30.46,)|
Show InChI InChI=1S/C27H30F4N2O4/c1-25(36,27(29,30)31)18-8-6-17(7-9-18)23(34)33(19-10-11-19)20-12-14-26(15-13-20,16-37-24(32)35)21-4-2-3-5-22(21)28/h2-9,19-20,36H,10-16H2,1H3,(H2,32,35)/t20-,25-,26-/m0/s1
Reactome pathway
n/an/a 14n/an/an/an/an/an/a
Amgen Inc
Curated by ChEMBL
Assay Description
Inhibition of human recombinant full length 11beta-HSD1 expressed in human adipocytes assessed as inhibition of conversion of [3H]cortisone to [3H]co...
Bioorg Med Chem Lett 21: 405-10 (2010)
Article DOI: 10.1016/j.bmcl.2010.10.129
BindingDB Entry DOI: 10.7270/Q2K937SB